null
SMILES: CN1CCC(=CC1)c1c[nH]c2ccc(cc12)C#N
InChI Key: InChIKey=HNOKHIURIJOQKM-UHFFFAOYSA-N
Activity Spreadsheet -- Enzyme Inhibition Constant Data from BindingDB
Found 4 hits for monomerid = 50209177
Trg + Lig
Ki
nM
ΔG°
kcal/mole
IC50
nM
Kd
nM
EC50/IC50
nM
koff
s-1
kon
M-1s-1
pHTemp
°C
5-hydroxytryptamine receptor 1A
(Rattus norvegicus (rat))
BDBM50209177
(3-(1-Methyl-1,2,3,6-tetrahydro-pyridin-4-yl)-1H-in...)
Show SMILES CN1CCC(=CC1)c1c[nH]c2ccc(cc12)C#N |c:4|
Show InChI InChI=1S/C15H15N3/c1-18-6-4-12(5-7-18)14-10-17-15-3-2-11(9-16)8-13(14)15/h2-4,8,10,17H,5-7H2,1H3
55n/an/an/an/an/an/an/an/a
University of Georgia
Curated by ChEMBL
Assay Description
Binding affinity towards 5-hydroxytryptamine 1A receptor using [3H]8-OH-DPAT as radioligand.
J Med Chem 36: 4006-14 (1993)
Article DOI: 10.1021/jm00077a003
BindingDB Entry DOI: 10.7270/Q2W37ZJ4
5-hydroxytryptamine receptor 1A
(Rattus norvegicus (rat))
BDBM50209177
(3-(1-Methyl-1,2,3,6-tetrahydro-pyridin-4-yl)-1H-in...)
Show SMILES CN1CCC(=CC1)c1c[nH]c2ccc(cc12)C#N |c:4|
Show InChI InChI=1S/C15H15N3/c1-18-6-4-12(5-7-18)14-10-17-15-3-2-11(9-16)8-13(14)15/h2-4,8,10,17H,5-7H2,1H3
55n/an/an/an/an/an/an/an/a
Universit£ de Lausanne
Curated by ChEMBL
Assay Description
Binding affinity of a compound to rat brain 5-hydroxytryptamine 1A (serotonin) receptor assayed by radiolabeled [3H]-8-OH-DPAT ligand displacement
J Med Chem 39: 126-34 (1996)
Article DOI: 10.1021/jm950410b
BindingDB Entry DOI: 10.7270/Q2VX0K7V
Serotonin 2 (5-HT2) receptor
(RAT-Rattus norvegicus (Rat)-Rattus norvegicus (rat...)
BDBM50209177
(3-(1-Methyl-1,2,3,6-tetrahydro-pyridin-4-yl)-1H-in...)
Show SMILES CN1CCC(=CC1)c1c[nH]c2ccc(cc12)C#N |c:4|
Show InChI InChI=1S/C15H15N3/c1-18-6-4-12(5-7-18)14-10-17-15-3-2-11(9-16)8-13(14)15/h2-4,8,10,17H,5-7H2,1H3
955n/an/an/an/an/an/an/an/a
University of Georgia
Curated by ChEMBL
Assay Description
Binding affinity towards 5-hydroxytryptamine 2 receptor using [3H]-ketanserin as radioligand.
J Med Chem 36: 4006-14 (1993)
Article DOI: 10.1021/jm00077a003
BindingDB Entry DOI: 10.7270/Q2W37ZJ4
Sodium-dependent serotonin transporter
(Homo sapiens (Human))
BDBM50209177
(3-(1-Methyl-1,2,3,6-tetrahydro-pyridin-4-yl)-1H-in...)
Show SMILES CN1CCC(=CC1)c1c[nH]c2ccc(cc12)C#N |c:4|
Show InChI InChI=1S/C15H15N3/c1-18-6-4-12(5-7-18)14-10-17-15-3-2-11(9-16)8-13(14)15/h2-4,8,10,17H,5-7H2,1H3
n/an/a 19n/an/an/an/an/an/a
Bristol-Myers Squibb Pharmaceutical Research Institute
Curated by ChEMBL
Assay Description
Displacement of [3H]citalopram from human SERT expressed in HEK293 cells
Bioorg Med Chem Lett 17: 3099-104 (2007)
Article DOI: 10.1016/j.bmcl.2007.03.040
BindingDB Entry DOI: 10.7270/Q2QN66F8