BDBM50209212 CHEMBL225852::cid_14262872::glaucine methiodide
SMILES: COc1cc2C[C@H]3c4c(CC[N+]3(C)C)cc(OC)c(OC)c4-c2cc1OC
InChI Key: InChIKey=WKHHFWJJIRCXHA-INIZCTEOSA-N
Data: 2 KI  4 IC50
Activity Spreadsheet -- Enzyme Inhibition Constant Data from BindingDB
Found 6 hits for monomerid = 50209212
Trg + Lig
Ki
nM
ΔG°
kcal/mole
IC50
nM
Kd
nM
EC50/IC50
nM
koff
s-1
kon
M-1s-1
pHTemp
°C
Neuronal acetylcholine receptor subunit alpha-4/beta-2
(Homo sapiens (Human))
BDBM50209212
(CHEMBL225852 | cid_14262872 | glaucine methiodide)
Show SMILES COc1cc2C[C@H]3c4c(CC[N+]3(C)C)cc(OC)c(OC)c4-c2cc1OC
Show InChI InChI=1S/C22H28NO4/c1-23(2)8-7-13-10-19(26-5)22(27-6)21-15-12-18(25-4)17(24-3)11-14(15)9-16(23)20(13)21/h10-12,16H,7-9H2,1-6H3/q+1/t16-/m0/s1
NCI pathway
Reactome pathway
1.00E+4n/an/an/an/an/an/an/an/a
University of Chile
Curated by ChEMBL
Assay Description
Displacement of [3H]cytisine from human alpha4beta2 nAChR expressed in SH-EP1 cells
Bioorg Med Chem 15: 3368-72 (2007)
Article DOI: 10.1016/j.bmc.2007.03.023
BindingDB Entry DOI: 10.7270/Q2G73DDV
Neuronal acetylcholine receptor subunit alpha-7
(Homo sapiens (Human))
BDBM50209212
(CHEMBL225852 | cid_14262872 | glaucine methiodide)
Show SMILES COc1cc2C[C@H]3c4c(CC[N+]3(C)C)cc(OC)c(OC)c4-c2cc1OC
Show InChI InChI=1S/C22H28NO4/c1-23(2)8-7-13-10-19(26-5)22(27-6)21-15-12-18(25-4)17(24-3)11-14(15)9-16(23)20(13)21/h10-12,16H,7-9H2,1-6H3/q+1/t16-/m0/s1
1.80E+4n/an/an/an/an/an/an/an/a
University of Chile
Curated by ChEMBL
Assay Description
Displacement of [125I]alpha-bungarotoxin from human alpha7 nAChR expressed in SH-SY5Y cells
Bioorg Med Chem 15: 3368-72 (2007)
Article DOI: 10.1016/j.bmc.2007.03.023
BindingDB Entry DOI: 10.7270/Q2G73DDV
Neuronal acetylcholine receptor subunit alpha-4/beta-2
(Homo sapiens (Human))
BDBM50209212
(CHEMBL225852 | cid_14262872 | glaucine methiodide)
Show SMILES COc1cc2C[C@H]3c4c(CC[N+]3(C)C)cc(OC)c(OC)c4-c2cc1OC
Show InChI InChI=1S/C22H28NO4/c1-23(2)8-7-13-10-19(26-5)22(27-6)21-15-12-18(25-4)17(24-3)11-14(15)9-16(23)20(13)21/h10-12,16H,7-9H2,1-6H3/q+1/t16-/m0/s1
NCI pathway
Reactome pathway
n/an/a 3.40E+4n/an/an/an/an/an/a
University of Chile
Curated by ChEMBL
Assay Description
Displacement of [3H]cytisine from human alpha4beta2 nAChR expressed in SH-EP1 cells
Bioorg Med Chem 15: 3368-72 (2007)
Article DOI: 10.1016/j.bmc.2007.03.023
BindingDB Entry DOI: 10.7270/Q2G73DDV
DNA dC->dU-editing enzyme APOBEC-3G
(Homo sapiens (Human))
BDBM50209212
(CHEMBL225852 | cid_14262872 | glaucine methiodide)
Show SMILES COc1cc2C[C@H]3c4c(CC[N+]3(C)C)cc(OC)c(OC)c4-c2cc1OC
Show InChI InChI=1S/C22H28NO4/c1-23(2)8-7-13-10-19(26-5)22(27-6)21-15-12-18(25-4)17(24-3)11-14(15)9-16(23)20(13)21/h10-12,16H,7-9H2,1-6H3/q+1/t16-/m0/s1
PCBioAssay
n/an/a 1.66E+3n/an/an/an/an/a25
Burnham Center for Chemical Genomics
Curated by PubChem BioAssay
Assay Description
Data Source: Sanford-Burnham Center for Chemical Genomics (SBCCG) Source Affiliation: Sanford-Burnham Medical Research Institute (SBMRI, San Diego, C...
PubChem Bioassay (2011)
BindingDB Entry DOI: 10.7270/Q2862DX0
DNA dC->dU-editing enzyme APOBEC-3A
(Homo sapiens (Human))
BDBM50209212
(CHEMBL225852 | cid_14262872 | glaucine methiodide)
Show SMILES COc1cc2C[C@H]3c4c(CC[N+]3(C)C)cc(OC)c(OC)c4-c2cc1OC
Show InChI InChI=1S/C22H28NO4/c1-23(2)8-7-13-10-19(26-5)22(27-6)21-15-12-18(25-4)17(24-3)11-14(15)9-16(23)20(13)21/h10-12,16H,7-9H2,1-6H3/q+1/t16-/m0/s1
PCBioAssay
n/an/a 1.85E+3n/an/an/an/an/a25
Burnham Center for Chemical Genomics
Curated by PubChem BioAssay
Assay Description
Data Source: Sanford-Burnham Center for Chemical Genomics (SBCCG) Source Affiliation: Sanford-Burnham Medical Research Institute (SBMRI, San Diego, C...
PubChem Bioassay (2011)
BindingDB Entry DOI: 10.7270/Q24F1P6P
Neuronal acetylcholine receptor subunit alpha-7
(Homo sapiens (Human))
BDBM50209212
(CHEMBL225852 | cid_14262872 | glaucine methiodide)
Show SMILES COc1cc2C[C@H]3c4c(CC[N+]3(C)C)cc(OC)c(OC)c4-c2cc1OC
Show InChI InChI=1S/C22H28NO4/c1-23(2)8-7-13-10-19(26-5)22(27-6)21-15-12-18(25-4)17(24-3)11-14(15)9-16(23)20(13)21/h10-12,16H,7-9H2,1-6H3/q+1/t16-/m0/s1
n/an/a 2.10E+4n/an/an/an/an/an/a
University of Chile
Curated by ChEMBL
Assay Description
Displacement of [125I]alpha-bungarotoxin from human alpha7 nAChR expressed in SH-SY5Y cells
Bioorg Med Chem 15: 3368-72 (2007)
Article DOI: 10.1016/j.bmc.2007.03.023
BindingDB Entry DOI: 10.7270/Q2G73DDV