null
SMILES: FC(F)(F)c1c(OCC2(CCCCC2)c2ccccc2)ccn2c(CC3CC3)nnc12
InChI Key: InChIKey=RIJQEYSVQQXNHD-UHFFFAOYSA-N
Activity Spreadsheet -- Enzyme Inhibition Constant Data from BindingDB
Found 1 hit for monomerid = 50209221
Trg + Lig
Ki
nM
ΔG°
kcal/mole
IC50
nM
Kd
nM
EC50/IC50
nM
koff
s-1
kon
M-1s-1
pHTemp
°C
Metabotropic glutamate receptor 2
(Homo sapiens (Human))
BDBM50209221
(CHEMBL3884094)
Show SMILES FC(F)(F)c1c(OCC2(CCCCC2)c2ccccc2)ccn2c(CC3CC3)nnc12
Show InChI InChI=1S/C24H26F3N3O/c25-24(26,27)21-19(11-14-30-20(15-17-9-10-17)28-29-22(21)30)31-16-23(12-5-2-6-13-23)18-7-3-1-4-8-18/h1,3-4,7-8,11,14,17H,2,5-6,9-10,12-13,15-16H2
n/an/an/an/a 1.80n/an/an/an/a
Bristol-Myers Squibb
Curated by ChEMBL
Assay Description
Positive allosteric modulation of human mGlu2 receptor expressed in HEK293 cells coexpressing rat glutamate transporter assessed as inhibition of for...
Bioorg Med Chem 25: 496-513 (2017)
Article DOI: 10.1016/j.bmc.2016.11.018
BindingDB Entry DOI: 10.7270/Q2QR504D