BDBM50209436 (3R)-3-(5-chloro-2-hydroxy-3-iodophenyl)-3-(2-(3-(5-fluoro-1,4,5,6-tetrahydropyrimidin-2-ylamino)-5-hydroxybenzamido)acetamido)propanoic acid::CHEMBL388916
SMILES: [#8]-[#6](=O)-[#6]-[#6@@H](-[#7]-[#6](=O)-[#6]-[#7]-[#6](=O)-c1cc(-[#8])cc(c1)\[#7]=[#6]-1\[#7]-[#6]-[#6](F)-[#6]-[#7]-1)-c1cc(Cl)cc(I)c1-[#8]
InChI Key: InChIKey=VWUFMKLHUVRYGA-QGZVFWFLSA-N
Data: 2 IC50
Activity Spreadsheet -- Enzyme Inhibition Constant Data from BindingDB
Found 2 hits for monomerid = 50209436
Trg + Lig
Ki
nM
ΔG°
kcal/mole
IC50
nM
Kd
nM
EC50/IC50
nM
koff
s-1
kon
M-1s-1
pHTemp
°C
ITGAV/ITGB3
(Homo sapiens (Human))
BDBM50209436
((3R)-3-(5-chloro-2-hydroxy-3-iodophenyl)-3-(2-(3-(...)
Show SMILES [#8]-[#6](=O)-[#6]-[#6@@H](-[#7]-[#6](=O)-[#6]-[#7]-[#6](=O)-c1cc(-[#8])cc(c1)\[#7]=[#6]-1\[#7]-[#6]-[#6](F)-[#6]-[#7]-1)-c1cc(Cl)cc(I)c1-[#8]
Show InChI InChI=1S/C22H22ClFIN5O6/c23-11-3-15(20(35)16(25)4-11)17(6-19(33)34)30-18(32)9-26-21(36)10-1-13(5-14(31)2-10)29-22-27-7-12(24)8-28-22/h1-5,12,17,31,35H,6-9H2,(H,26,36)(H,30,32)(H,33,34)(H2,27,28,29)/t17-/m1/s1
n/an/a 3n/an/an/an/an/an/a
Pfizer Global Research and Development
Curated by ChEMBL
Assay Description
Inhibition of alphaVbeta3 integrin receptor expressed in human 293 cells
Bioorg Med Chem 15: 3783-800 (2007)
Article DOI: 10.1016/j.bmc.2007.03.034
BindingDB Entry DOI: 10.7270/Q25Q4VR4
ITGAV/ITGB6
(Homo sapiens (Human))
BDBM50209436
((3R)-3-(5-chloro-2-hydroxy-3-iodophenyl)-3-(2-(3-(...)
Show SMILES [#8]-[#6](=O)-[#6]-[#6@@H](-[#7]-[#6](=O)-[#6]-[#7]-[#6](=O)-c1cc(-[#8])cc(c1)\[#7]=[#6]-1\[#7]-[#6]-[#6](F)-[#6]-[#7]-1)-c1cc(Cl)cc(I)c1-[#8]
Show InChI InChI=1S/C22H22ClFIN5O6/c23-11-3-15(20(35)16(25)4-11)17(6-19(33)34)30-18(32)9-26-21(36)10-1-13(5-14(31)2-10)29-22-27-7-12(24)8-28-22/h1-5,12,17,31,35H,6-9H2,(H,26,36)(H,30,32)(H,33,34)(H2,27,28,29)/t17-/m1/s1
n/an/a 164n/an/an/an/an/an/a
Pfizer Global Research and Development
Curated by ChEMBL
Assay Description
Inhibition of alphaVbeta6 integrin receptor in human 293 cells
Bioorg Med Chem 15: 3783-800 (2007)
Article DOI: 10.1016/j.bmc.2007.03.034
BindingDB Entry DOI: 10.7270/Q25Q4VR4