BDBM50209444 (3R)-3-(5-bromo-3-chloro-2-hydroxyphenyl)-3-(2-(3-(5-hydroxy-1,4,5,6-tetrahydropyrimidin-2-ylamino)benzamido)acetamido)propanoic acid::CHEMBL244216
SMILES: [#8]-[#6]-1-[#6]-[#7]\[#6](-[#7]-[#6]-1)=[#7]\c1cccc(c1)-[#6](=O)-[#7]-[#6]-[#6](=O)-[#7]-[#6@H](-[#6]-[#6](-[#8])=O)-c1cc(Br)cc(Cl)c1-[#8]
InChI Key: InChIKey=HHNHNFMVQIXWSQ-QGZVFWFLSA-N
Data: 2 IC50
Activity Spreadsheet -- Enzyme Inhibition Constant Data from BindingDB
Found 2 hits for monomerid = 50209444
Trg + Lig
Ki
nM
ΔG°
kcal/mole
IC50
nM
Kd
nM
EC50/IC50
nM
koff
s-1
kon
M-1s-1
pHTemp
°C
ITGAV/ITGB6
(Homo sapiens (Human))
BDBM50209444
((3R)-3-(5-bromo-3-chloro-2-hydroxyphenyl)-3-(2-(3-...)
Show SMILES [#8]-[#6]-1-[#6]-[#7]\[#6](-[#7]-[#6]-1)=[#7]\c1cccc(c1)-[#6](=O)-[#7]-[#6]-[#6](=O)-[#7]-[#6@H](-[#6]-[#6](-[#8])=O)-c1cc(Br)cc(Cl)c1-[#8]
Show InChI InChI=1S/C22H23BrClN5O6/c23-12-5-15(20(34)16(24)6-12)17(7-19(32)33)29-18(31)10-25-21(35)11-2-1-3-13(4-11)28-22-26-8-14(30)9-27-22/h1-6,14,17,30,34H,7-10H2,(H,25,35)(H,29,31)(H,32,33)(H2,26,27,28)/t17-/m1/s1
n/an/a 48n/an/an/an/an/an/a
Pfizer Global Research and Development
Curated by ChEMBL
Assay Description
Inhibition of alphaVbeta6 integrin receptor in human HT29 cells
Bioorg Med Chem 15: 3783-800 (2007)
Article DOI: 10.1016/j.bmc.2007.03.034
BindingDB Entry DOI: 10.7270/Q25Q4VR4
ITGAV/ITGB3
(Homo sapiens (Human))
BDBM50209444
((3R)-3-(5-bromo-3-chloro-2-hydroxyphenyl)-3-(2-(3-...)
Show SMILES [#8]-[#6]-1-[#6]-[#7]\[#6](-[#7]-[#6]-1)=[#7]\c1cccc(c1)-[#6](=O)-[#7]-[#6]-[#6](=O)-[#7]-[#6@H](-[#6]-[#6](-[#8])=O)-c1cc(Br)cc(Cl)c1-[#8]
Show InChI InChI=1S/C22H23BrClN5O6/c23-12-5-15(20(34)16(24)6-12)17(7-19(32)33)29-18(31)10-25-21(35)11-2-1-3-13(4-11)28-22-26-8-14(30)9-27-22/h1-6,14,17,30,34H,7-10H2,(H,25,35)(H,29,31)(H,32,33)(H2,26,27,28)/t17-/m1/s1
n/an/a 8n/an/an/an/an/an/a
Pfizer Global Research and Development
Curated by ChEMBL
Assay Description
Inhibition of alphaVbeta3 integrin receptor expressed in human 293 cells
Bioorg Med Chem 15: 3783-800 (2007)
Article DOI: 10.1016/j.bmc.2007.03.034
BindingDB Entry DOI: 10.7270/Q25Q4VR4