null
SMILES: [#8]-[#6](=O)-[#6]-[#6@@H](-[#7]-[#6](=O)-[#6]-[#7]-[#6](=O)-c1cccc(c1)\[#7]=[#6]-1\[#7]-[#6]-[#6](F)-[#6]-[#7]-1)-c1cc(Br)cc(Cl)c1-[#8]
InChI Key: InChIKey=ZCXXOBHMRHIAIP-QGZVFWFLSA-N
Activity Spreadsheet -- Enzyme Inhibition Constant Data from BindingDB
Found 2 hits for monomerid = 50209453
Trg + Lig
Ki
nM
ΔG°
kcal/mole
IC50
nM
Kd
nM
EC50/IC50
nM
koff
s-1
kon
M-1s-1
pHTemp
°C
Integrin alpha-V/beta-3
(Homo sapiens (Human))
BDBM50209453
((3R)-3-(5-bromo-3-chloro-2-hydroxyphenyl)-3-(2-(3-...)
Show SMILES [#8]-[#6](=O)-[#6]-[#6@@H](-[#7]-[#6](=O)-[#6]-[#7]-[#6](=O)-c1cccc(c1)\[#7]=[#6]-1\[#7]-[#6]-[#6](F)-[#6]-[#7]-1)-c1cc(Br)cc(Cl)c1-[#8]
Show InChI InChI=1S/C22H22BrClFN5O5/c23-12-5-15(20(34)16(24)6-12)17(7-19(32)33)30-18(31)10-26-21(35)11-2-1-3-14(4-11)29-22-27-8-13(25)9-28-22/h1-6,13,17,34H,7-10H2,(H,26,35)(H,30,31)(H,32,33)(H2,27,28,29)/t17-/m1/s1
n/an/a 2n/an/an/an/an/an/a
Pfizer Global Research and Development
Curated by ChEMBL
Assay Description
Inhibition of alphaVbeta3 integrin receptor expressed in human 293 cells
Bioorg Med Chem 15: 3783-800 (2007)
Article DOI: 10.1016/j.bmc.2007.03.034
BindingDB Entry DOI: 10.7270/Q25Q4VR4
Integrin alpha-V/beta-6
(Homo sapiens (Human))
BDBM50209453
((3R)-3-(5-bromo-3-chloro-2-hydroxyphenyl)-3-(2-(3-...)
Show SMILES [#8]-[#6](=O)-[#6]-[#6@@H](-[#7]-[#6](=O)-[#6]-[#7]-[#6](=O)-c1cccc(c1)\[#7]=[#6]-1\[#7]-[#6]-[#6](F)-[#6]-[#7]-1)-c1cc(Br)cc(Cl)c1-[#8]
Show InChI InChI=1S/C22H22BrClFN5O5/c23-12-5-15(20(34)16(24)6-12)17(7-19(32)33)30-18(31)10-26-21(35)11-2-1-3-14(4-11)29-22-27-8-13(25)9-28-22/h1-6,13,17,34H,7-10H2,(H,26,35)(H,30,31)(H,32,33)(H2,27,28,29)/t17-/m1/s1
n/an/a 25n/an/an/an/an/an/a
Pfizer Global Research and Development
Curated by ChEMBL
Assay Description
Inhibition of alphaVbeta6 integrin receptor in human HT29 cells
Bioorg Med Chem 15: 3783-800 (2007)
Article DOI: 10.1016/j.bmc.2007.03.034
BindingDB Entry DOI: 10.7270/Q25Q4VR4