BDBM50209473 (R)-3-(3,5-dichloro-2-hydroxyphenyl)-3-(2-(3-(1,4,5,6-tetrahydropyrimidin-2-ylamino)benzamido)acetamido)propanoic acid::CHEMBL241912
SMILES: [#8]-[#6](=O)-[#6]-[#6@@H](-[#7]-[#6](=O)-[#6]-[#7]-[#6](=O)-c1cccc(c1)\[#7]=[#6]-1\[#7]-[#6]-[#6]-[#6]-[#7]-1)-c1cc(Cl)cc(Cl)c1-[#8]
InChI Key: InChIKey=WFUPBFSKWZGBJT-QGZVFWFLSA-N
Data: 2 IC50
Activity Spreadsheet -- Enzyme Inhibition Constant Data from BindingDB
Found 2 hits for monomerid = 50209473
Trg + Lig
Ki
nM
ΔG°
kcal/mole
IC50
nM
Kd
nM
EC50/IC50
nM
koff
s-1
kon
M-1s-1
pHTemp
°C
Integrin alpha-V/beta-6
(Homo sapiens (Human))
BDBM50209473
((R)-3-(3,5-dichloro-2-hydroxyphenyl)-3-(2-(3-(1,4,...)
Show SMILES [#8]-[#6](=O)-[#6]-[#6@@H](-[#7]-[#6](=O)-[#6]-[#7]-[#6](=O)-c1cccc(c1)\[#7]=[#6]-1\[#7]-[#6]-[#6]-[#6]-[#7]-1)-c1cc(Cl)cc(Cl)c1-[#8]
Show InChI InChI=1S/C22H23Cl2N5O5/c23-13-8-15(20(33)16(24)9-13)17(10-19(31)32)29-18(30)11-27-21(34)12-3-1-4-14(7-12)28-22-25-5-2-6-26-22/h1,3-4,7-9,17,33H,2,5-6,10-11H2,(H,27,34)(H,29,30)(H,31,32)(H2,25,26,28)/t17-/m1/s1
n/an/a 24n/an/an/an/an/an/a
Pfizer Global Research and Development
Curated by ChEMBL
Assay Description
Inhibition of alphaVbeta6 integrin receptor in human HT29 cells
Bioorg Med Chem 15: 3783-800 (2007)
Article DOI: 10.1016/j.bmc.2007.03.034
BindingDB Entry DOI: 10.7270/Q25Q4VR4
Integrin alpha-V/beta-3
(Homo sapiens (Human))
BDBM50209473
((R)-3-(3,5-dichloro-2-hydroxyphenyl)-3-(2-(3-(1,4,...)
Show SMILES [#8]-[#6](=O)-[#6]-[#6@@H](-[#7]-[#6](=O)-[#6]-[#7]-[#6](=O)-c1cccc(c1)\[#7]=[#6]-1\[#7]-[#6]-[#6]-[#6]-[#7]-1)-c1cc(Cl)cc(Cl)c1-[#8]
Show InChI InChI=1S/C22H23Cl2N5O5/c23-13-8-15(20(33)16(24)9-13)17(10-19(31)32)29-18(30)11-27-21(34)12-3-1-4-14(7-12)28-22-25-5-2-6-26-22/h1,3-4,7-9,17,33H,2,5-6,10-11H2,(H,27,34)(H,29,30)(H,31,32)(H2,25,26,28)/t17-/m1/s1
n/an/a 4n/an/an/an/an/an/a
Pfizer Global Research and Development
Curated by ChEMBL
Assay Description
Inhibition of alphaVbeta3 integrin receptor expressed in human 293 cells
Bioorg Med Chem 15: 3783-800 (2007)
Article DOI: 10.1016/j.bmc.2007.03.034
BindingDB Entry DOI: 10.7270/Q25Q4VR4