null
SMILES: [#6]-c1cc(-[#6])c(-[#8])c(c1)-[#6@H](-[#6]-[#6](-[#8])=O)-[#7]-[#6](=O)-[#6]-[#7]-[#6](=O)-c1cc(-[#8])cc(c1)\[#7]=[#6]-1\[#7]-[#6]-[#6](-[#8])-[#6]-[#7]-1
InChI Key: InChIKey=FMEVGRFJSOMYRX-IBGZPJMESA-N
Activity Spreadsheet -- Enzyme Inhibition Constant Data from BindingDB
Found 1 hit for monomerid = 50209488
Trg + Lig
Ki
nM
ΔG°
kcal/mole
IC50
nM
Kd
nM
EC50/IC50
nM
koff
s-1
kon
M-1s-1
pHTemp
°C
Integrin alpha-V/beta-3
(Homo sapiens (Human))
BDBM50209488
((3S)-3-(2-hydroxy-3,5-dimethylphenyl)-3-(2-(3-hydr...)
Show SMILES [#6]-c1cc(-[#6])c(-[#8])c(c1)-[#6@H](-[#6]-[#6](-[#8])=O)-[#7]-[#6](=O)-[#6]-[#7]-[#6](=O)-c1cc(-[#8])cc(c1)\[#7]=[#6]-1\[#7]-[#6]-[#6](-[#8])-[#6]-[#7]-1
Show InChI InChI=1S/C24H29N5O7/c1-12-3-13(2)22(35)18(4-12)19(8-21(33)34)29-20(32)11-25-23(36)14-5-15(7-16(30)6-14)28-24-26-9-17(31)10-27-24/h3-7,17,19,30-31,35H,8-11H2,1-2H3,(H,25,36)(H,29,32)(H,33,34)(H2,26,27,28)/t19-/m0/s1
n/an/a 1n/an/an/an/an/an/a
Pfizer Global Research and Development
Curated by ChEMBL
Assay Description
Inhibition of alphaVbeta3 integrin receptor expressed in human 293 cells
Bioorg Med Chem 15: 3783-800 (2007)
Article DOI: 10.1016/j.bmc.2007.03.034
BindingDB Entry DOI: 10.7270/Q25Q4VR4