BDBM50209501 CHEMBL3884669
SMILES: CN(Cc1ccccn1)c1ccc(cc1S(=O)(=O)N(C)\N=C(/C)c1cnn2ccc(cc12)C#N)[N+]([O-])=O
InChI Key: InChIKey=QUOIBHFHLNBGGV-OGLMXYFKSA-N
Data: 2 IC50
Activity Spreadsheet -- Enzyme Inhibition Constant Data from BindingDB
Found 2 hits for monomerid = 50209501
Trg + Lig
Ki
nM
ΔG°
kcal/mole
IC50
nM
Kd
nM
EC50/IC50
nM
koff
s-1
kon
M-1s-1
pHTemp
°C
p110β/p85α
(Homo sapiens (Human))
BDBM50209501
(CHEMBL3884669)
Show SMILES CN(Cc1ccccn1)c1ccc(cc1S(=O)(=O)N(C)\N=C(/C)c1cnn2ccc(cc12)C#N)[N+]([O-])=O
Show InChI InChI=1S/C24H22N8O4S/c1-17(21-15-27-31-11-9-18(14-25)12-23(21)31)28-30(3)37(35,36)24-13-20(32(33)34)7-8-22(24)29(2)16-19-6-4-5-10-26-19/h4-13,15H,16H2,1-3H3/b28-17+
n/an/a 9.40E+3n/an/an/an/an/an/a
University of Auckland
Curated by ChEMBL
Assay Description
Inhibition of recombinant human p110beta/N-terminal His-tagged human p85alpha expressed in baculovirus infected sf cells using L-alpha-phosphatidylin...
Bioorg Med Chem Lett 27: 187-190 (2017)
Article DOI: 10.1016/j.bmcl.2016.11.078
BindingDB Entry DOI: 10.7270/Q2BG2R0D
Phosphatidylinositol 4,5-bisphosphate 3-kinase catalytic subunit delta isoform
(Homo sapiens (Human))
BDBM50209501
(CHEMBL3884669)
Show SMILES CN(Cc1ccccn1)c1ccc(cc1S(=O)(=O)N(C)\N=C(/C)c1cnn2ccc(cc12)C#N)[N+]([O-])=O
Show InChI InChI=1S/C24H22N8O4S/c1-17(21-15-27-31-11-9-18(14-25)12-23(21)31)28-30(3)37(35,36)24-13-20(32(33)34)7-8-22(24)29(2)16-19-6-4-5-10-26-19/h4-13,15H,16H2,1-3H3/b28-17+
NCI pathway
Reactome pathway
n/an/a 575n/an/an/an/an/an/a
University of Auckland
Curated by ChEMBL
Assay Description
Inhibition of p110delta (unknown origin) using L-alpha phosphatidylinositol as substrate after 1 hr in presence of [gamma33]-ATP by thin layer chroma...
Bioorg Med Chem Lett 27: 187-190 (2017)
Article DOI: 10.1016/j.bmcl.2016.11.078
BindingDB Entry DOI: 10.7270/Q2BG2R0D