BDBM50209506 CHEMBL266212::N-(2-(4-(4-(3,4-dimethoxybenzyl)piperazin-1-yl)phenylcarbamoyl)phenyl)quinoline-3-carboxamide
SMILES: COc1ccc(CN2CCN(CC2)c2ccc(NC(=O)c3ccccc3NC(=O)c3cnc4ccccc4c3)cc2)cc1OC
InChI Key: InChIKey=LYPHFRXCVAZTEC-UHFFFAOYSA-N
Data: 10 IC50  1 EC50
Activity Spreadsheet -- Enzyme Inhibition Constant Data from BindingDB
Found 11 hits for monomerid = 50209506
Trg + Lig
Ki
nM
ΔG°
kcal/mole
IC50
nM
Kd
nM
EC50/IC50
nM
koff
s-1
kon
M-1s-1
pHTemp
°C
Cytochrome P450 2A6
(Homo sapiens (Human))
BDBM50209506
(CHEMBL266212 | N-(2-(4-(4-(3,4-dimethoxybenzyl)pip...)
Show SMILES COc1ccc(CN2CCN(CC2)c2ccc(NC(=O)c3ccccc3NC(=O)c3cnc4ccccc4c3)cc2)cc1OC
Show InChI InChI=1S/C36H35N5O4/c1-44-33-16-11-25(21-34(33)45-2)24-40-17-19-41(20-18-40)29-14-12-28(13-15-29)38-36(43)30-8-4-6-10-32(30)39-35(42)27-22-26-7-3-5-9-31(26)37-23-27/h3-16,21-23H,17-20,24H2,1-2H3,(H,38,43)(H,39,42)
Reactome pathway
n/an/a>1.00E+5n/an/an/an/an/an/a
Université Laval
Curated by ChEMBL
Assay Description
Inhibition of human CYP2A6 expressed in insect microsome after 15 mins
Bioorg Med Chem 15: 3854-68 (2007)
Article DOI: 10.1016/j.bmc.2007.03.014
BindingDB Entry DOI: 10.7270/Q2X63MN5
Cytochrome P450 3A4
(Homo sapiens (Human))
BDBM50209506
(CHEMBL266212 | N-(2-(4-(4-(3,4-dimethoxybenzyl)pip...)
Show SMILES COc1ccc(CN2CCN(CC2)c2ccc(NC(=O)c3ccccc3NC(=O)c3cnc4ccccc4c3)cc2)cc1OC
Show InChI InChI=1S/C36H35N5O4/c1-44-33-16-11-25(21-34(33)45-2)24-40-17-19-41(20-18-40)29-14-12-28(13-15-29)38-36(43)30-8-4-6-10-32(30)39-35(42)27-22-26-7-3-5-9-31(26)37-23-27/h3-16,21-23H,17-20,24H2,1-2H3,(H,38,43)(H,39,42)
Reactome pathway
n/an/a 2.02E+4n/an/an/an/an/an/a
Université Laval
Curated by ChEMBL
Assay Description
Inhibition of human CYP3A4 expressed in insect microsome using 7-benzyloxy-4-trifluoromethylcoumarin substrate after 30 mins
Bioorg Med Chem 15: 3854-68 (2007)
Article DOI: 10.1016/j.bmc.2007.03.014
BindingDB Entry DOI: 10.7270/Q2X63MN5
Cytochrome P450 2B6
(Homo sapiens (Human))
BDBM50209506
(CHEMBL266212 | N-(2-(4-(4-(3,4-dimethoxybenzyl)pip...)
Show SMILES COc1ccc(CN2CCN(CC2)c2ccc(NC(=O)c3ccccc3NC(=O)c3cnc4ccccc4c3)cc2)cc1OC
Show InChI InChI=1S/C36H35N5O4/c1-44-33-16-11-25(21-34(33)45-2)24-40-17-19-41(20-18-40)29-14-12-28(13-15-29)38-36(43)30-8-4-6-10-32(30)39-35(42)27-22-26-7-3-5-9-31(26)37-23-27/h3-16,21-23H,17-20,24H2,1-2H3,(H,38,43)(H,39,42)
n/an/a>1.00E+5n/an/an/an/an/an/a
Université Laval
Curated by ChEMBL
Assay Description
Inhibition of human CYP2B6 expressed in insect microsome after 30 mins
Bioorg Med Chem 15: 3854-68 (2007)
Article DOI: 10.1016/j.bmc.2007.03.014
BindingDB Entry DOI: 10.7270/Q2X63MN5
Cytochrome P450 1A
(Homo sapiens (Human))
BDBM50209506
(CHEMBL266212 | N-(2-(4-(4-(3,4-dimethoxybenzyl)pip...)
Show SMILES COc1ccc(CN2CCN(CC2)c2ccc(NC(=O)c3ccccc3NC(=O)c3cnc4ccccc4c3)cc2)cc1OC
Show InChI InChI=1S/C36H35N5O4/c1-44-33-16-11-25(21-34(33)45-2)24-40-17-19-41(20-18-40)29-14-12-28(13-15-29)38-36(43)30-8-4-6-10-32(30)39-35(42)27-22-26-7-3-5-9-31(26)37-23-27/h3-16,21-23H,17-20,24H2,1-2H3,(H,38,43)(H,39,42)
Reactome pathway
n/an/a>1.00E+5n/an/an/an/an/an/a
Université Laval
Curated by ChEMBL
Assay Description
Inhibition of human CYP1A2 expressed in insect microsome after 15 mins
Bioorg Med Chem 15: 3854-68 (2007)
Article DOI: 10.1016/j.bmc.2007.03.014
BindingDB Entry DOI: 10.7270/Q2X63MN5
Cytochrome P450 2E1
(Homo sapiens (Human))
BDBM50209506
(CHEMBL266212 | N-(2-(4-(4-(3,4-dimethoxybenzyl)pip...)
Show SMILES COc1ccc(CN2CCN(CC2)c2ccc(NC(=O)c3ccccc3NC(=O)c3cnc4ccccc4c3)cc2)cc1OC
Show InChI InChI=1S/C36H35N5O4/c1-44-33-16-11-25(21-34(33)45-2)24-40-17-19-41(20-18-40)29-14-12-28(13-15-29)38-36(43)30-8-4-6-10-32(30)39-35(42)27-22-26-7-3-5-9-31(26)37-23-27/h3-16,21-23H,17-20,24H2,1-2H3,(H,38,43)(H,39,42)
Reactome pathway
n/an/a>1.00E+5n/an/an/an/an/an/a
Université Laval
Curated by ChEMBL
Assay Description
Inhibition of human CYP2E1 expressed in insect microsome after 45 mins
Bioorg Med Chem 15: 3854-68 (2007)
Article DOI: 10.1016/j.bmc.2007.03.014
BindingDB Entry DOI: 10.7270/Q2X63MN5
Cytochrome P450 2C8
(Homo sapiens (Human))
BDBM50209506
(CHEMBL266212 | N-(2-(4-(4-(3,4-dimethoxybenzyl)pip...)
Show SMILES COc1ccc(CN2CCN(CC2)c2ccc(NC(=O)c3ccccc3NC(=O)c3cnc4ccccc4c3)cc2)cc1OC
Show InChI InChI=1S/C36H35N5O4/c1-44-33-16-11-25(21-34(33)45-2)24-40-17-19-41(20-18-40)29-14-12-28(13-15-29)38-36(43)30-8-4-6-10-32(30)39-35(42)27-22-26-7-3-5-9-31(26)37-23-27/h3-16,21-23H,17-20,24H2,1-2H3,(H,38,43)(H,39,42)
n/an/a 1.33E+4n/an/an/an/an/an/a
Université Laval
Curated by ChEMBL
Assay Description
Inhibition of human CYP2C8 expressed in insect microsome after 30 mins
Bioorg Med Chem 15: 3854-68 (2007)
Article DOI: 10.1016/j.bmc.2007.03.014
BindingDB Entry DOI: 10.7270/Q2X63MN5
Cytochrome P450 2C19
(Homo sapiens (Human))
BDBM50209506
(CHEMBL266212 | N-(2-(4-(4-(3,4-dimethoxybenzyl)pip...)
Show SMILES COc1ccc(CN2CCN(CC2)c2ccc(NC(=O)c3ccccc3NC(=O)c3cnc4ccccc4c3)cc2)cc1OC
Show InChI InChI=1S/C36H35N5O4/c1-44-33-16-11-25(21-34(33)45-2)24-40-17-19-41(20-18-40)29-14-12-28(13-15-29)38-36(43)30-8-4-6-10-32(30)39-35(42)27-22-26-7-3-5-9-31(26)37-23-27/h3-16,21-23H,17-20,24H2,1-2H3,(H,38,43)(H,39,42)
Reactome pathway
n/an/a 2.30E+4n/an/an/an/an/an/a
Université Laval
Curated by ChEMBL
Assay Description
Inhibition of human CYP2C19 expressed in insect microsome after 30 mins
Bioorg Med Chem 15: 3854-68 (2007)
Article DOI: 10.1016/j.bmc.2007.03.014
BindingDB Entry DOI: 10.7270/Q2X63MN5
P-glycoprotein 1
(Homo sapiens (Human))
BDBM50209506
(CHEMBL266212 | N-(2-(4-(4-(3,4-dimethoxybenzyl)pip...)
Show SMILES COc1ccc(CN2CCN(CC2)c2ccc(NC(=O)c3ccccc3NC(=O)c3cnc4ccccc4c3)cc2)cc1OC
Show InChI InChI=1S/C36H35N5O4/c1-44-33-16-11-25(21-34(33)45-2)24-40-17-19-41(20-18-40)29-14-12-28(13-15-29)38-36(43)30-8-4-6-10-32(30)39-35(42)27-22-26-7-3-5-9-31(26)37-23-27/h3-16,21-23H,17-20,24H2,1-2H3,(H,38,43)(H,39,42)
n/an/an/an/a 124n/an/an/an/a
Université Laval
Curated by ChEMBL
Assay Description
Reversal of P-gp-mediated multidrug resistance to vinblastine in human CEM/VLB500 cells after 3 days by resazurin assay
Bioorg Med Chem 15: 3854-68 (2007)
Article DOI: 10.1016/j.bmc.2007.03.014
BindingDB Entry DOI: 10.7270/Q2X63MN5
Cytochrome P450 2D6
(Homo sapiens (Human))
BDBM50209506
(CHEMBL266212 | N-(2-(4-(4-(3,4-dimethoxybenzyl)pip...)
Show SMILES COc1ccc(CN2CCN(CC2)c2ccc(NC(=O)c3ccccc3NC(=O)c3cnc4ccccc4c3)cc2)cc1OC
Show InChI InChI=1S/C36H35N5O4/c1-44-33-16-11-25(21-34(33)45-2)24-40-17-19-41(20-18-40)29-14-12-28(13-15-29)38-36(43)30-8-4-6-10-32(30)39-35(42)27-22-26-7-3-5-9-31(26)37-23-27/h3-16,21-23H,17-20,24H2,1-2H3,(H,38,43)(H,39,42)
n/an/a>1.00E+5n/an/an/an/an/an/a
Université Laval
Curated by ChEMBL
Assay Description
Inhibition of human CYP2D6 expressed in insect microsome after 30 mins
Bioorg Med Chem 15: 3854-68 (2007)
Article DOI: 10.1016/j.bmc.2007.03.014
BindingDB Entry DOI: 10.7270/Q2X63MN5
Cytochrome P450 2C9
(Homo sapiens (Human))
BDBM50209506
(CHEMBL266212 | N-(2-(4-(4-(3,4-dimethoxybenzyl)pip...)
Show SMILES COc1ccc(CN2CCN(CC2)c2ccc(NC(=O)c3ccccc3NC(=O)c3cnc4ccccc4c3)cc2)cc1OC
Show InChI InChI=1S/C36H35N5O4/c1-44-33-16-11-25(21-34(33)45-2)24-40-17-19-41(20-18-40)29-14-12-28(13-15-29)38-36(43)30-8-4-6-10-32(30)39-35(42)27-22-26-7-3-5-9-31(26)37-23-27/h3-16,21-23H,17-20,24H2,1-2H3,(H,38,43)(H,39,42)
Reactome pathway
n/an/a>1.00E+4n/an/an/an/an/an/a
Université Laval
Curated by ChEMBL
Assay Description
Inhibition of human CYP2C9 expressed in insect microsome after 45 mins
Bioorg Med Chem 15: 3854-68 (2007)
Article DOI: 10.1016/j.bmc.2007.03.014
BindingDB Entry DOI: 10.7270/Q2X63MN5
Cytochrome P450 3A4
(Homo sapiens (Human))
BDBM50209506
(CHEMBL266212 | N-(2-(4-(4-(3,4-dimethoxybenzyl)pip...)
Show SMILES COc1ccc(CN2CCN(CC2)c2ccc(NC(=O)c3ccccc3NC(=O)c3cnc4ccccc4c3)cc2)cc1OC
Show InChI InChI=1S/C36H35N5O4/c1-44-33-16-11-25(21-34(33)45-2)24-40-17-19-41(20-18-40)29-14-12-28(13-15-29)38-36(43)30-8-4-6-10-32(30)39-35(42)27-22-26-7-3-5-9-31(26)37-23-27/h3-16,21-23H,17-20,24H2,1-2H3,(H,38,43)(H,39,42)
Reactome pathway
n/an/a 3.58E+3n/an/an/an/an/an/a
Université Laval
Curated by ChEMBL
Assay Description
Inhibition of human CYP2E1 expressed in insect microsome using 7-benzyloxyquinoline substrate after 30 mins
Bioorg Med Chem 15: 3854-68 (2007)
Article DOI: 10.1016/j.bmc.2007.03.014
BindingDB Entry DOI: 10.7270/Q2X63MN5