BDBM50209508 CHEMBL242983::N-(2-(4-(4-(3,4-dimethoxybenzyl)piperazin-1-yl)phenylcarbamoyl)-4,5-dimethoxyphenyl)quinoline-3-carboxamide
SMILES: COc1ccc(CN2CCN(CC2)c2ccc(NC(=O)c3cc(OC)c(OC)cc3NC(=O)c3cnc4ccccc4c3)cc2)cc1OC
InChI Key: InChIKey=KFUYKTYUJHLOPQ-UHFFFAOYSA-N
Data: 8 IC50  1 EC50
Activity Spreadsheet -- Enzyme Inhibition Constant Data from BindingDB
Found 9 hits for monomerid = 50209508
Trg + Lig
Ki
nM
ΔG°
kcal/mole
IC50
nM
Kd
nM
EC50/IC50
nM
koff
s-1
kon
M-1s-1
pHTemp
°C
Cytochrome P450 3A4
(Homo sapiens (Human))
BDBM50209508
(CHEMBL242983 | N-(2-(4-(4-(3,4-dimethoxybenzyl)pip...)
Show SMILES COc1ccc(CN2CCN(CC2)c2ccc(NC(=O)c3cc(OC)c(OC)cc3NC(=O)c3cnc4ccccc4c3)cc2)cc1OC
Show InChI InChI=1S/C38H39N5O6/c1-46-33-14-9-25(19-34(33)47-2)24-42-15-17-43(18-16-42)29-12-10-28(11-13-29)40-38(45)30-21-35(48-3)36(49-4)22-32(30)41-37(44)27-20-26-7-5-6-8-31(26)39-23-27/h5-14,19-23H,15-18,24H2,1-4H3,(H,40,45)(H,41,44)
Reactome pathway
n/an/a 195n/an/an/an/an/an/a
Université Laval
Curated by ChEMBL
Assay Description
Inhibition of human CYP3A4 expressed in insect microsome using 7-benzyloxy-4-trifluoromethylcoumarin substrate after 30 mins
Bioorg Med Chem 15: 3854-68 (2007)
Article DOI: 10.1016/j.bmc.2007.03.014
BindingDB Entry DOI: 10.7270/Q2X63MN5
ATP-dependent translocase ABCB1
(Homo sapiens (Human))
BDBM50209508
(CHEMBL242983 | N-(2-(4-(4-(3,4-dimethoxybenzyl)pip...)
Show SMILES COc1ccc(CN2CCN(CC2)c2ccc(NC(=O)c3cc(OC)c(OC)cc3NC(=O)c3cnc4ccccc4c3)cc2)cc1OC
Show InChI InChI=1S/C38H39N5O6/c1-46-33-14-9-25(19-34(33)47-2)24-42-15-17-43(18-16-42)29-12-10-28(11-13-29)40-38(45)30-21-35(48-3)36(49-4)22-32(30)41-37(44)27-20-26-7-5-6-8-31(26)39-23-27/h5-14,19-23H,15-18,24H2,1-4H3,(H,40,45)(H,41,44)
n/an/an/an/a 59n/an/an/an/a
Université Laval
Curated by ChEMBL
Assay Description
Reversal of P-gp-mediated multidrug resistance to vinblastine in human CEM/VLB500 cells after 3 days by resazurin assay
Bioorg Med Chem 15: 3854-68 (2007)
Article DOI: 10.1016/j.bmc.2007.03.014
BindingDB Entry DOI: 10.7270/Q2X63MN5
Cytochrome P450 3A4
(Homo sapiens (Human))
BDBM50209508
(CHEMBL242983 | N-(2-(4-(4-(3,4-dimethoxybenzyl)pip...)
Show SMILES COc1ccc(CN2CCN(CC2)c2ccc(NC(=O)c3cc(OC)c(OC)cc3NC(=O)c3cnc4ccccc4c3)cc2)cc1OC
Show InChI InChI=1S/C38H39N5O6/c1-46-33-14-9-25(19-34(33)47-2)24-42-15-17-43(18-16-42)29-12-10-28(11-13-29)40-38(45)30-21-35(48-3)36(49-4)22-32(30)41-37(44)27-20-26-7-5-6-8-31(26)39-23-27/h5-14,19-23H,15-18,24H2,1-4H3,(H,40,45)(H,41,44)
Reactome pathway
n/an/a 2.48E+3n/an/an/an/an/an/a
Université Laval
Curated by ChEMBL
Assay Description
Inhibition of human CYP2E1 expressed in insect microsome using 7-benzyloxyquinoline substrate after 30 mins
Bioorg Med Chem 15: 3854-68 (2007)
Article DOI: 10.1016/j.bmc.2007.03.014
BindingDB Entry DOI: 10.7270/Q2X63MN5
Cytochrome P450 2D6
(Homo sapiens (Human))
BDBM50209508
(CHEMBL242983 | N-(2-(4-(4-(3,4-dimethoxybenzyl)pip...)
Show SMILES COc1ccc(CN2CCN(CC2)c2ccc(NC(=O)c3cc(OC)c(OC)cc3NC(=O)c3cnc4ccccc4c3)cc2)cc1OC
Show InChI InChI=1S/C38H39N5O6/c1-46-33-14-9-25(19-34(33)47-2)24-42-15-17-43(18-16-42)29-12-10-28(11-13-29)40-38(45)30-21-35(48-3)36(49-4)22-32(30)41-37(44)27-20-26-7-5-6-8-31(26)39-23-27/h5-14,19-23H,15-18,24H2,1-4H3,(H,40,45)(H,41,44)
n/an/a 1.73E+4n/an/an/an/an/an/a
Université Laval
Curated by ChEMBL
Assay Description
Inhibition of human CYP2D6 expressed in insect microsome after 30 mins
Bioorg Med Chem 15: 3854-68 (2007)
Article DOI: 10.1016/j.bmc.2007.03.014
BindingDB Entry DOI: 10.7270/Q2X63MN5
Cytochrome P450 2C9
(Homo sapiens (Human))
BDBM50209508
(CHEMBL242983 | N-(2-(4-(4-(3,4-dimethoxybenzyl)pip...)
Show SMILES COc1ccc(CN2CCN(CC2)c2ccc(NC(=O)c3cc(OC)c(OC)cc3NC(=O)c3cnc4ccccc4c3)cc2)cc1OC
Show InChI InChI=1S/C38H39N5O6/c1-46-33-14-9-25(19-34(33)47-2)24-42-15-17-43(18-16-42)29-12-10-28(11-13-29)40-38(45)30-21-35(48-3)36(49-4)22-32(30)41-37(44)27-20-26-7-5-6-8-31(26)39-23-27/h5-14,19-23H,15-18,24H2,1-4H3,(H,40,45)(H,41,44)
Reactome pathway
n/an/a 97n/an/an/an/an/an/a
Université Laval
Curated by ChEMBL
Assay Description
Inhibition of human CYP2C9 expressed in insect microsome after 45 mins
Bioorg Med Chem 15: 3854-68 (2007)
Article DOI: 10.1016/j.bmc.2007.03.014
BindingDB Entry DOI: 10.7270/Q2X63MN5
Cytochrome P450 2B6
(Homo sapiens (Human))
BDBM50209508
(CHEMBL242983 | N-(2-(4-(4-(3,4-dimethoxybenzyl)pip...)
Show SMILES COc1ccc(CN2CCN(CC2)c2ccc(NC(=O)c3cc(OC)c(OC)cc3NC(=O)c3cnc4ccccc4c3)cc2)cc1OC
Show InChI InChI=1S/C38H39N5O6/c1-46-33-14-9-25(19-34(33)47-2)24-42-15-17-43(18-16-42)29-12-10-28(11-13-29)40-38(45)30-21-35(48-3)36(49-4)22-32(30)41-37(44)27-20-26-7-5-6-8-31(26)39-23-27/h5-14,19-23H,15-18,24H2,1-4H3,(H,40,45)(H,41,44)
n/an/a 1.00E+5n/an/an/an/an/an/a
Université Laval
Curated by ChEMBL
Assay Description
Inhibition of human CYP2B6 expressed in insect microsome after 30 mins
Bioorg Med Chem 15: 3854-68 (2007)
Article DOI: 10.1016/j.bmc.2007.03.014
BindingDB Entry DOI: 10.7270/Q2X63MN5
Cytochrome P450 1A2
(Homo sapiens (Human))
BDBM50209508
(CHEMBL242983 | N-(2-(4-(4-(3,4-dimethoxybenzyl)pip...)
Show SMILES COc1ccc(CN2CCN(CC2)c2ccc(NC(=O)c3cc(OC)c(OC)cc3NC(=O)c3cnc4ccccc4c3)cc2)cc1OC
Show InChI InChI=1S/C38H39N5O6/c1-46-33-14-9-25(19-34(33)47-2)24-42-15-17-43(18-16-42)29-12-10-28(11-13-29)40-38(45)30-21-35(48-3)36(49-4)22-32(30)41-37(44)27-20-26-7-5-6-8-31(26)39-23-27/h5-14,19-23H,15-18,24H2,1-4H3,(H,40,45)(H,41,44)
Reactome pathway
n/an/a 6.68E+3n/an/an/an/an/an/a
Université Laval
Curated by ChEMBL
Assay Description
Inhibition of human CYP1A2 expressed in insect microsome after 15 mins
Bioorg Med Chem 15: 3854-68 (2007)
Article DOI: 10.1016/j.bmc.2007.03.014
BindingDB Entry DOI: 10.7270/Q2X63MN5
Cytochrome P450 2C19
(Homo sapiens (Human))
BDBM50209508
(CHEMBL242983 | N-(2-(4-(4-(3,4-dimethoxybenzyl)pip...)
Show SMILES COc1ccc(CN2CCN(CC2)c2ccc(NC(=O)c3cc(OC)c(OC)cc3NC(=O)c3cnc4ccccc4c3)cc2)cc1OC
Show InChI InChI=1S/C38H39N5O6/c1-46-33-14-9-25(19-34(33)47-2)24-42-15-17-43(18-16-42)29-12-10-28(11-13-29)40-38(45)30-21-35(48-3)36(49-4)22-32(30)41-37(44)27-20-26-7-5-6-8-31(26)39-23-27/h5-14,19-23H,15-18,24H2,1-4H3,(H,40,45)(H,41,44)
Reactome pathway
n/an/a 393n/an/an/an/an/an/a
Université Laval
Curated by ChEMBL
Assay Description
Inhibition of human CYP2C19 expressed in insect microsome after 30 mins
Bioorg Med Chem 15: 3854-68 (2007)
Article DOI: 10.1016/j.bmc.2007.03.014
BindingDB Entry DOI: 10.7270/Q2X63MN5
Cytochrome P450 2C8
(Homo sapiens (Human))
BDBM50209508
(CHEMBL242983 | N-(2-(4-(4-(3,4-dimethoxybenzyl)pip...)
Show SMILES COc1ccc(CN2CCN(CC2)c2ccc(NC(=O)c3cc(OC)c(OC)cc3NC(=O)c3cnc4ccccc4c3)cc2)cc1OC
Show InChI InChI=1S/C38H39N5O6/c1-46-33-14-9-25(19-34(33)47-2)24-42-15-17-43(18-16-42)29-12-10-28(11-13-29)40-38(45)30-21-35(48-3)36(49-4)22-32(30)41-37(44)27-20-26-7-5-6-8-31(26)39-23-27/h5-14,19-23H,15-18,24H2,1-4H3,(H,40,45)(H,41,44)
n/an/a 1.08E+3n/an/an/an/an/an/a
Université Laval
Curated by ChEMBL
Assay Description
Inhibition of human CYP2C8 expressed in insect microsome after 30 mins
Bioorg Med Chem 15: 3854-68 (2007)
Article DOI: 10.1016/j.bmc.2007.03.014
BindingDB Entry DOI: 10.7270/Q2X63MN5