BDBM50209567 CHEMBL3883926
SMILES: CN(C)CCN(C)c1ccc(cc1S(=O)(=O)N(C)\N=C\c1cnn2ccc(cc12)C#N)C#N
InChI Key: InChIKey=BRCHSRCZNYQTCR-MFKUBSTISA-N
Data: 2 IC50
Activity Spreadsheet -- Enzyme Inhibition Constant Data from BindingDB
Found 2 hits for monomerid = 50209567
Trg + Lig
Ki
nM
ΔG°
kcal/mole
IC50
nM
Kd
nM
EC50/IC50
nM
koff
s-1
kon
M-1s-1
pHTemp
°C
Phosphatidylinositol 4,5-bisphosphate 3-kinase catalytic subunit delta isoform
(Homo sapiens (Human))
BDBM50209567
(CHEMBL3883926)
Show SMILES CN(C)CCN(C)c1ccc(cc1S(=O)(=O)N(C)\N=C\c1cnn2ccc(cc12)C#N)C#N
Show InChI InChI=1S/C22H24N8O2S/c1-27(2)9-10-28(3)20-6-5-17(13-23)12-22(20)33(31,32)29(4)25-15-19-16-26-30-8-7-18(14-24)11-21(19)30/h5-8,11-12,15-16H,9-10H2,1-4H3/b25-15+
NCI pathway
Reactome pathway
n/an/a 380n/an/an/an/an/an/a
University of Auckland
Curated by ChEMBL
Assay Description
Inhibition of p110delta (unknown origin) using L-alpha phosphatidylinositol as substrate after 1 hr in presence of [gamma33]-ATP by thin layer chroma...
Bioorg Med Chem Lett 27: 187-190 (2017)
Article DOI: 10.1016/j.bmcl.2016.11.078
BindingDB Entry DOI: 10.7270/Q2BG2R0D
p110β/p85α
(Homo sapiens (Human))
BDBM50209567
(CHEMBL3883926)
Show SMILES CN(C)CCN(C)c1ccc(cc1S(=O)(=O)N(C)\N=C\c1cnn2ccc(cc12)C#N)C#N
Show InChI InChI=1S/C22H24N8O2S/c1-27(2)9-10-28(3)20-6-5-17(13-23)12-22(20)33(31,32)29(4)25-15-19-16-26-30-8-7-18(14-24)11-21(19)30/h5-8,11-12,15-16H,9-10H2,1-4H3/b25-15+
n/an/a 2.00E+3n/an/an/an/an/an/a
University of Auckland
Curated by ChEMBL
Assay Description
Inhibition of recombinant human p110beta/N-terminal His-tagged human p85alpha expressed in baculovirus infected sf cells using L-alpha-phosphatidylin...
Bioorg Med Chem Lett 27: 187-190 (2017)
Article DOI: 10.1016/j.bmcl.2016.11.078
BindingDB Entry DOI: 10.7270/Q2BG2R0D