BDBM50209981 1-((3R,4R)-3-(((S)-3-(4-fluorobenzyl)piperidin-1-yl)methyl)-1-(tetrahydro-2H-pyran-4-carbonyl)piperidin-4-yl)-3-(5-acetyl-4-methylthiazol-2-yl)urea::CHEMBL403742
SMILES: CC(=O)c1sc(NC(=O)N[C@@H]2CCN(C[C@H]2CN2CCC[C@@H](Cc3ccc(F)cc3)C2)C(=O)C2CCOCC2)nc1C
InChI Key: InChIKey=GXEUOMNYYYTCOF-VXQMPNGUSA-N
Data: 2 IC50
Activity Spreadsheet -- Enzyme Inhibition Constant Data from BindingDB
Found 2 hits for monomerid = 50209981
Trg + Lig
Ki
nM
ΔG°
kcal/mole
IC50
nM
Kd
nM
EC50/IC50
nM
koff
s-1
kon
M-1s-1
pHTemp
°C
Cytochrome P450 2D6
(Homo sapiens (Human))
BDBM50209981
(1-((3R,4R)-3-(((S)-3-(4-fluorobenzyl)piperidin-1-y...)
Show SMILES CC(=O)c1sc(NC(=O)N[C@@H]2CCN(C[C@H]2CN2CCC[C@@H](Cc3ccc(F)cc3)C2)C(=O)C2CCOCC2)nc1C
Show InChI InChI=1S/C31H42FN5O4S/c1-20-28(21(2)38)42-31(33-20)35-30(40)34-27-9-13-37(29(39)24-10-14-41-15-11-24)19-25(27)18-36-12-3-4-23(17-36)16-22-5-7-26(32)8-6-22/h5-8,23-25,27H,3-4,9-19H2,1-2H3,(H2,33,34,35,40)/t23-,25+,27+/m0/s1
n/an/a 1.20E+3n/an/an/an/an/an/a
Bristol-Myers Squibb Pharmaceutical Research Institute
Curated by ChEMBL
Assay Description
Inhibition of human recombinant CYP2D6
Bioorg Med Chem Lett 17: 2992-7 (2007)
Article DOI: 10.1016/j.bmcl.2007.03.065
BindingDB Entry DOI: 10.7270/Q2V987SQ
C-C chemokine receptor type 3
(Homo sapiens (Human))
BDBM50209981
(1-((3R,4R)-3-(((S)-3-(4-fluorobenzyl)piperidin-1-y...)
Show SMILES CC(=O)c1sc(NC(=O)N[C@@H]2CCN(C[C@H]2CN2CCC[C@@H](Cc3ccc(F)cc3)C2)C(=O)C2CCOCC2)nc1C
Show InChI InChI=1S/C31H42FN5O4S/c1-20-28(21(2)38)42-31(33-20)35-30(40)34-27-9-13-37(29(39)24-10-14-41-15-11-24)19-25(27)18-36-12-3-4-23(17-36)16-22-5-7-26(32)8-6-22/h5-8,23-25,27H,3-4,9-19H2,1-2H3,(H2,33,34,35,40)/t23-,25+,27+/m0/s1
Reactome pathway
n/an/a 1.20n/an/an/an/an/an/a
Bristol-Myers Squibb Pharmaceutical Research Institute
Curated by ChEMBL
Assay Description
Displacement of [125I]eotaxin from human CCR3 expressed in CHO cells after 30 mins
Bioorg Med Chem Lett 17: 2992-7 (2007)
Article DOI: 10.1016/j.bmcl.2007.03.065
BindingDB Entry DOI: 10.7270/Q2V987SQ