BDBM50210011 1-((3S,4R)-3-(((S)-3-(4-fluorobenzyl)piperidin-1-yl)methyl)-tetrahydro-2H-pyran-4-yl)-3-(5-acetyl-4-methylthiazol-2-yl)urea::CHEMBL251232
SMILES: CC(=O)c1sc(NC(=O)N[C@@H]2CCOC[C@H]2CN2CCC[C@@H](Cc3ccc(F)cc3)C2)nc1C
InChI Key: InChIKey=COHCCHMMIZLJTB-TUNNFDKTSA-N
Data: 2 IC50
Activity Spreadsheet -- Enzyme Inhibition Constant Data from BindingDB
Found 2 hits for monomerid = 50210011
Trg + Lig
Ki
nM
ΔG°
kcal/mole
IC50
nM
Kd
nM
EC50/IC50
nM
koff
s-1
kon
M-1s-1
pHTemp
°C
C-C chemokine receptor type 3
(Homo sapiens (Human))
BDBM50210011
(1-((3S,4R)-3-(((S)-3-(4-fluorobenzyl)piperidin-1-y...)
Show SMILES CC(=O)c1sc(NC(=O)N[C@@H]2CCOC[C@H]2CN2CCC[C@@H](Cc3ccc(F)cc3)C2)nc1C
Show InChI InChI=1S/C25H33FN4O3S/c1-16-23(17(2)31)34-25(27-16)29-24(32)28-22-9-11-33-15-20(22)14-30-10-3-4-19(13-30)12-18-5-7-21(26)8-6-18/h5-8,19-20,22H,3-4,9-15H2,1-2H3,(H2,27,28,29,32)/t19-,20+,22+/m0/s1
Reactome pathway
n/an/a 2n/an/an/an/an/an/a
Bristol-Myers Squibb Pharmaceutical Research Institute
Curated by ChEMBL
Assay Description
Displacement of [125I]eotaxin from human CCR3 expressed in CHO cells after 30 mins
Bioorg Med Chem Lett 17: 2992-7 (2007)
Article DOI: 10.1016/j.bmcl.2007.03.065
BindingDB Entry DOI: 10.7270/Q2V987SQ
Cytochrome P450 2D6
(Homo sapiens (Human))
BDBM50210011
(1-((3S,4R)-3-(((S)-3-(4-fluorobenzyl)piperidin-1-y...)
Show SMILES CC(=O)c1sc(NC(=O)N[C@@H]2CCOC[C@H]2CN2CCC[C@@H](Cc3ccc(F)cc3)C2)nc1C
Show InChI InChI=1S/C25H33FN4O3S/c1-16-23(17(2)31)34-25(27-16)29-24(32)28-22-9-11-33-15-20(22)14-30-10-3-4-19(13-30)12-18-5-7-21(26)8-6-18/h5-8,19-20,22H,3-4,9-15H2,1-2H3,(H2,27,28,29,32)/t19-,20+,22+/m0/s1
n/an/a 490n/an/an/an/an/an/a
Bristol-Myers Squibb Pharmaceutical Research Institute
Curated by ChEMBL
Assay Description
Inhibition of human recombinant CYP2D6
Bioorg Med Chem Lett 17: 2992-7 (2007)
Article DOI: 10.1016/j.bmcl.2007.03.065
BindingDB Entry DOI: 10.7270/Q2V987SQ