BDBM50210023 1-((3S,4S)-4-(((S)-3-(4-fluorobenzyl)piperidin-1-yl)methyl)-1-(1-methylpiperidin-4-yl)piperidin-3-yl)-3-(5-acetyl-4-methylthiazol-2-yl)urea::CHEMBL251220
SMILES: CN1CCC(CC1)N1CC[C@@H](CN2CCC[C@@H](Cc3ccc(F)cc3)C2)[C@@H](C1)NC(=O)Nc1nc(C)c(s1)C(C)=O
InChI Key: InChIKey=DUQPPLUAQADJCL-PNIUZAESSA-N
Data: 2 IC50
Activity Spreadsheet -- Enzyme Inhibition Constant Data from BindingDB
Found 2 hits for monomerid = 50210023
Trg + Lig
Ki
nM
ΔG°
kcal/mole
IC50
nM
Kd
nM
EC50/IC50
nM
koff
s-1
kon
M-1s-1
pHTemp
°C
Cytochrome P450 2D6
(Homo sapiens (Human))
BDBM50210023
(1-((3S,4S)-4-(((S)-3-(4-fluorobenzyl)piperidin-1-y...)
Show SMILES CN1CCC(CC1)N1CC[C@@H](CN2CCC[C@@H](Cc3ccc(F)cc3)C2)[C@@H](C1)NC(=O)Nc1nc(C)c(s1)C(C)=O
Show InChI InChI=1S/C31H45FN6O2S/c1-21-29(22(2)39)41-31(33-21)35-30(40)34-28-20-38(27-11-14-36(3)15-12-27)16-10-25(28)19-37-13-4-5-24(18-37)17-23-6-8-26(32)9-7-23/h6-9,24-25,27-28H,4-5,10-20H2,1-3H3,(H2,33,34,35,40)/t24-,25-,28+/m0/s1
n/an/a 1.20E+4n/an/an/an/an/an/a
Bristol-Myers Squibb Pharmaceutical Research Institute
Curated by ChEMBL
Assay Description
Inhibition of human recombinant CYP2D6
Bioorg Med Chem Lett 17: 2992-7 (2007)
Article DOI: 10.1016/j.bmcl.2007.03.065
BindingDB Entry DOI: 10.7270/Q2V987SQ
C-C chemokine receptor type 3
(Homo sapiens (Human))
BDBM50210023
(1-((3S,4S)-4-(((S)-3-(4-fluorobenzyl)piperidin-1-y...)
Show SMILES CN1CCC(CC1)N1CC[C@@H](CN2CCC[C@@H](Cc3ccc(F)cc3)C2)[C@@H](C1)NC(=O)Nc1nc(C)c(s1)C(C)=O
Show InChI InChI=1S/C31H45FN6O2S/c1-21-29(22(2)39)41-31(33-21)35-30(40)34-28-20-38(27-11-14-36(3)15-12-27)16-10-25(28)19-37-13-4-5-24(18-37)17-23-6-8-26(32)9-7-23/h6-9,24-25,27-28H,4-5,10-20H2,1-3H3,(H2,33,34,35,40)/t24-,25-,28+/m0/s1
Reactome pathway
n/an/a 1.40n/an/an/an/an/an/a
Bristol-Myers Squibb Pharmaceutical Research Institute
Curated by ChEMBL
Assay Description
Displacement of [125I]eotaxin from human CCR3 expressed in CHO cells after 30 mins
Bioorg Med Chem Lett 17: 2992-7 (2007)
Article DOI: 10.1016/j.bmcl.2007.03.065
BindingDB Entry DOI: 10.7270/Q2V987SQ