BDBM50210344 BROMODEOXYTOPSENTIN
SMILES: Brc1ccc2c(c[nH]c2c1)-c1cnc([nH]1)C(=O)c1c[nH]c2ccccc12
InChI Key: InChIKey=RMAWSNVDVKZXDX-UHFFFAOYSA-N
Data: 2 IC50
Activity Spreadsheet -- Enzyme Inhibition Constant Data from BindingDB
Found 2 hits for monomerid = 50210344
Trg + Lig
Ki
nM
ΔG°
kcal/mole
IC50
nM
Kd
nM
EC50/IC50
nM
koff
s-1
kon
M-1s-1
pHTemp
°C
Sortase A (SrtA)
(Staphylococcus aureus)
BDBM50210344
(BROMODEOXYTOPSENTIN)
Show SMILES Brc1ccc2c(c[nH]c2c1)-c1cnc([nH]1)C(=O)c1c[nH]c2ccccc12
Show InChI InChI=1S/C20H13BrN4O/c21-11-5-6-13-14(8-23-17(13)7-11)18-10-24-20(25-18)19(26)15-9-22-16-4-2-1-3-12(15)16/h1-10,22-23H,(H,24,25)
n/an/a 4.68E+4n/an/an/an/an/an/a
Seoul National University
Curated by ChEMBL
Assay Description
Inhibitory activity against Sortase A from Staphylococcus aureus
Bioorg Med Chem Lett 15: 4927-31 (2005)
Article DOI: 10.1016/j.bmcl.2005.08.021
BindingDB Entry DOI: 10.7270/Q2QN69HD
Pyruvate kinase
(Staphylococcus aureus (strain MRSA252))
BDBM50210344
(BROMODEOXYTOPSENTIN)
Show SMILES Brc1ccc2c(c[nH]c2c1)-c1cnc([nH]1)C(=O)c1c[nH]c2ccccc12
Show InChI InChI=1S/C20H13BrN4O/c21-11-5-6-13-14(8-23-17(13)7-11)18-10-24-20(25-18)19(26)15-9-22-16-4-2-1-3-12(15)16/h1-10,22-23H,(H,24,25)
n/an/a 60n/an/an/an/an/an/a
Simon Fraser University
Curated by ChEMBL
Assay Description
Inhibition of recombinant N-terminal His-tagged methicillin-resistant Staphylococcus aureus MRSA252 pyruvate kinase expressed in Escherichia coli BL2...
Eur J Med Chem 125: 1-13 (2017)
Article DOI: 10.1016/j.ejmech.2016.09.018
BindingDB Entry DOI: 10.7270/Q2CC12P0