BDBM50210464 CHEMBL3958246
SMILES: Oc1c(Br)cccc1NC(=O)c1cc2ccc(Br)cc2[nH]1
InChI Key: InChIKey=XXRWMJLOXKLRHG-UHFFFAOYSA-N
Data: 1 IC50
Activity Spreadsheet -- Enzyme Inhibition Constant Data from BindingDB
Found 1 hit for monomerid = 50210464
Trg + Lig
Ki
nM
ΔG°
kcal/mole
IC50
nM
Kd
nM
EC50/IC50
nM
koff
s-1
kon
M-1s-1
pHTemp
°C
Pyruvate kinase
(Staphylococcus aureus (strain MRSA252))
BDBM50210464
(CHEMBL3958246)
Show SMILES Oc1c(Br)cccc1NC(=O)c1cc2ccc(Br)cc2[nH]1
Show InChI InChI=1S/C15H10Br2N2O2/c16-9-5-4-8-6-13(18-12(8)7-9)15(21)19-11-3-1-2-10(17)14(11)20/h1-7,18,20H,(H,19,21)
n/an/a 116n/an/an/an/an/an/a
Simon Fraser University
Curated by ChEMBL
Assay Description
Inhibition of recombinant N-terminal His-tagged methicillin-resistant Staphylococcus aureus MRSA252 pyruvate kinase expressed in Escherichia coli BL2...
Eur J Med Chem 125: 1-13 (2017)
Article DOI: 10.1016/j.ejmech.2016.09.018
BindingDB Entry DOI: 10.7270/Q2CC12P0