BDBM50210591 CHEMBL245293::N-(4-chlorobenzyl)-2-((ethyl(2-hydroxy-2-phenylethyl)amino)methyl)-7-methyl-4-oxo-4,7-dihydrothieno[2,3-b]pyridine-5-carboxamide
SMILES: CCN(CC(O)c1ccccc1)Cc1cc2c(s1)n(C)cc(C(=O)NCc1ccc(Cl)cc1)c2=O
InChI Key: InChIKey=OQCZUSLRQQWAJG-UHFFFAOYSA-N
Data: 1 IC50
Activity Spreadsheet -- Enzyme Inhibition Constant Data from BindingDB
Found 1 hit for monomerid = 50210591
Trg + Lig
Ki
nM
ΔG°
kcal/mole
IC50
nM
Kd
nM
EC50/IC50
nM
koff
s-1
kon
M-1s-1
pHTemp
°C
DNA polymerase
(Human cytomegalovirus (HCMV strain AD169) )
BDBM50210591
(CHEMBL245293 | N-(4-chlorobenzyl)-2-((ethyl(2-hydr...)
Show SMILES CCN(CC(O)c1ccccc1)Cc1cc2c(s1)n(C)cc(C(=O)NCc1ccc(Cl)cc1)c2=O |w:4.4|
Show InChI InChI=1S/C27H28ClN3O3S/c1-3-31(17-24(32)19-7-5-4-6-8-19)15-21-13-22-25(33)23(16-30(2)27(22)35-21)26(34)29-14-18-9-11-20(28)12-10-18/h4-13,16,24,32H,3,14-15,17H2,1-2H3,(H,29,34)
n/an/a 240n/an/an/an/an/an/a
Pfizer Inc.
Curated by ChEMBL
Assay Description
Inhibition of HCMV DNA polymerase by scintillation proximity assay
Bioorg Med Chem Lett 17: 3349-53 (2007)
Article DOI: 10.1016/j.bmcl.2007.03.102
BindingDB Entry DOI: 10.7270/Q2HX1DHN