BDBM50210598 (S)-N-(4-chlorobenzyl)-2-(((2-hydroxypropyl)(methyl)amino)methyl)-7-methyl-4-oxo-4,7-dihydrothieno[2,3-b]pyridine-5-carboxamide::CHEMBL247955
SMILES: C[C@H](O)CN(C)Cc1cc2c(s1)n(C)cc(C(=O)NCc1ccc(Cl)cc1)c2=O
InChI Key: InChIKey=SHTWNFWCUXHAJL-ZDUSSCGKSA-N
Data: 1 IC50
Activity Spreadsheet -- Enzyme Inhibition Constant Data from BindingDB
Found 1 hit for monomerid = 50210598
Trg + Lig
Ki
nM
ΔG°
kcal/mole
IC50
nM
Kd
nM
EC50/IC50
nM
koff
s-1
kon
M-1s-1
pHTemp
°C
DNA polymerase
(Human cytomegalovirus (HCMV strain AD169) )
BDBM50210598
((S)-N-(4-chlorobenzyl)-2-(((2-hydroxypropyl)(methy...)
Show SMILES C[C@H](O)CN(C)Cc1cc2c(s1)n(C)cc(C(=O)NCc1ccc(Cl)cc1)c2=O
Show InChI InChI=1S/C21H24ClN3O3S/c1-13(26)10-24(2)11-16-8-17-19(27)18(12-25(3)21(17)29-16)20(28)23-9-14-4-6-15(22)7-5-14/h4-8,12-13,26H,9-11H2,1-3H3,(H,23,28)/t13-/m0/s1
n/an/a 35n/an/an/an/an/an/a
Pfizer Inc.
Curated by ChEMBL
Assay Description
Inhibition of HCMV DNA polymerase by scintillation proximity assay
Bioorg Med Chem Lett 17: 3349-53 (2007)
Article DOI: 10.1016/j.bmcl.2007.03.102
BindingDB Entry DOI: 10.7270/Q2HX1DHN