BDBM50210607 CHEMBL247750::N-(4-chlorobenzyl)-2-(((2-hydroxy-2-(thiazol-2-yl)ethyl)(methyl)amino)methyl)-7-methyl-4-oxo-4,7-dihydrothieno[2,3-b]pyridine-5-carboxamide
SMILES: CN(CC(O)c1nccs1)Cc1cc2c(s1)n(C)cc(C(=O)NCc1ccc(Cl)cc1)c2=O
InChI Key: InChIKey=DWZJDIBKSXNONS-UHFFFAOYSA-N
Data: 1 IC50
Activity Spreadsheet -- Enzyme Inhibition Constant Data from BindingDB
Found 1 hit for monomerid = 50210607
Trg + Lig
Ki
nM
ΔG°
kcal/mole
IC50
nM
Kd
nM
EC50/IC50
nM
koff
s-1
kon
M-1s-1
pHTemp
°C
DNA polymerase
(Human cytomegalovirus (HCMV strain AD169) )
BDBM50210607
(CHEMBL247750 | N-(4-chlorobenzyl)-2-(((2-hydroxy-2...)
Show SMILES CN(CC(O)c1nccs1)Cc1cc2c(s1)n(C)cc(C(=O)NCc1ccc(Cl)cc1)c2=O |w:3.3|
Show InChI InChI=1S/C23H23ClN4O3S2/c1-27(13-19(29)22-25-7-8-32-22)11-16-9-17-20(30)18(12-28(2)23(17)33-16)21(31)26-10-14-3-5-15(24)6-4-14/h3-9,12,19,29H,10-11,13H2,1-2H3,(H,26,31)
n/an/a 235n/an/an/an/an/an/a
Pfizer Inc.
Curated by ChEMBL
Assay Description
Inhibition of HCMV DNA polymerase by scintillation proximity assay
Bioorg Med Chem Lett 17: 3349-53 (2007)
Article DOI: 10.1016/j.bmcl.2007.03.102
BindingDB Entry DOI: 10.7270/Q2HX1DHN