BDBM50210658 (R)-3-amino-1-(3-(trifluoromethyl)-5,6-dihydro-[1,2,4]triazolo[4,3-a]pyrazin-7(8H)-yl)-4-(2,4,6-trifluorophenyl)butan-1-one::CHEMBL394834
SMILES: N[C@@H](CC(=O)N1CCn2c(C1)nnc2C(F)(F)F)Cc1c(F)cc(F)cc1F
InChI Key: InChIKey=OQHRDSUVLLYQSD-SECBINFHSA-N
Data: 4 IC50
Activity Spreadsheet -- Enzyme Inhibition Constant Data from BindingDB
Found 4 hits for monomerid = 50210658
Trg + Lig
Ki
nM
ΔG°
kcal/mole
IC50
nM
Kd
nM
EC50/IC50
nM
koff
s-1
kon
M-1s-1
pHTemp
°C
Dipeptidyl peptidase VIII
(Homo sapiens (Human))
BDBM50210658
((R)-3-amino-1-(3-(trifluoromethyl)-5,6-dihydro-[1,...)
Show SMILES N[C@@H](CC(=O)N1CCn2c(C1)nnc2C(F)(F)F)Cc1c(F)cc(F)cc1F |r|
Show InChI InChI=1S/C16H15F6N5O/c17-8-3-11(18)10(12(19)4-8)5-9(23)6-14(28)26-1-2-27-13(7-26)24-25-15(27)16(20,21)22/h3-4,9H,1-2,5-7,23H2/t9-/m1/s1
n/an/a>1.00E+4n/an/an/an/an/an/a
Merck Research Laboratories
Curated by ChEMBL
Assay Description
Inhibition of DPP8 activity
Bioorg Med Chem Lett 17: 3373-7 (2007)
Article DOI: 10.1016/j.bmcl.2007.03.098
BindingDB Entry DOI: 10.7270/Q2W37W04
Dipeptidyl peptidase 4
(Homo sapiens (Human))
BDBM50210658
((R)-3-amino-1-(3-(trifluoromethyl)-5,6-dihydro-[1,...)
Show SMILES N[C@@H](CC(=O)N1CCn2c(C1)nnc2C(F)(F)F)Cc1c(F)cc(F)cc1F |r|
Show InChI InChI=1S/C16H15F6N5O/c17-8-3-11(18)10(12(19)4-8)5-9(23)6-14(28)26-1-2-27-13(7-26)24-25-15(27)16(20,21)22/h3-4,9H,1-2,5-7,23H2/t9-/m1/s1
Reactome pathway
n/an/a 87n/an/an/an/an/an/a
Merck Research Laboratories
Curated by ChEMBL
Assay Description
Inhibition of DPP4 (unknown origin)
J Med Chem 51: 4359-69 (2008)
Article DOI: 10.1021/jm800219f
BindingDB Entry DOI: 10.7270/Q28915N5
Dipeptidyl peptidase 9
(Homo sapiens (Human))
BDBM50210658
((R)-3-amino-1-(3-(trifluoromethyl)-5,6-dihydro-[1,...)
Show SMILES N[C@@H](CC(=O)N1CCn2c(C1)nnc2C(F)(F)F)Cc1c(F)cc(F)cc1F |r|
Show InChI InChI=1S/C16H15F6N5O/c17-8-3-11(18)10(12(19)4-8)5-9(23)6-14(28)26-1-2-27-13(7-26)24-25-15(27)16(20,21)22/h3-4,9H,1-2,5-7,23H2/t9-/m1/s1
n/an/a>1.00E+5n/an/an/an/an/an/a
Merck Research Laboratories
Curated by ChEMBL
Assay Description
Inhibition of DPP9 activity
Bioorg Med Chem Lett 17: 3373-7 (2007)
Article DOI: 10.1016/j.bmcl.2007.03.098
BindingDB Entry DOI: 10.7270/Q2W37W04
Dipeptidyl peptidase 4
(Homo sapiens (Human))
BDBM50210658
((R)-3-amino-1-(3-(trifluoromethyl)-5,6-dihydro-[1,...)
Show SMILES N[C@@H](CC(=O)N1CCn2c(C1)nnc2C(F)(F)F)Cc1c(F)cc(F)cc1F |r|
Show InChI InChI=1S/C16H15F6N5O/c17-8-3-11(18)10(12(19)4-8)5-9(23)6-14(28)26-1-2-27-13(7-26)24-25-15(27)16(20,21)22/h3-4,9H,1-2,5-7,23H2/t9-/m1/s1
Reactome pathway
n/an/a 87n/an/an/an/an/an/a
Merck Research Laboratories
Curated by ChEMBL
Assay Description
Inhibition of DPP4 activity
Bioorg Med Chem Lett 17: 3373-7 (2007)
Article DOI: 10.1016/j.bmcl.2007.03.098
BindingDB Entry DOI: 10.7270/Q2W37W04