BDBM50211132 2-biphenyl-4-yl-N-(2-ethoxy-ethyl)-N-{(R)-1-[3-(4-ethoxy-phenyl)-4-oxo-3,4-dihydro-quinazolin-2-yl]-ethyl}-acetamide::CHEMBL266663
SMILES: CCOCCN([C@H](C)c1nc2ccccc2c(=O)n1-c1ccc(OCC)cc1)C(=O)Cc1ccc(cc1)-c1ccccc1
InChI Key: InChIKey=KVLVNIPIDDIANW-AREMUKBSSA-N
Data: 1 IC50
Activity Spreadsheet -- Enzyme Inhibition Constant Data from BindingDB
Found 1 hit for monomerid = 50211132
Trg + Lig
Ki
nM
ΔG°
kcal/mole
IC50
nM
Kd
nM
EC50/IC50
nM
koff
s-1
kon
M-1s-1
pHTemp
°C
chemokine (C-X-C motif) receptor 3
(Homo sapiens (Human))
BDBM50211132
(2-biphenyl-4-yl-N-(2-ethoxy-ethyl)-N-{(R)-1-[3-(4-...)
Show SMILES CCOCCN([C@H](C)c1nc2ccccc2c(=O)n1-c1ccc(OCC)cc1)C(=O)Cc1ccc(cc1)-c1ccccc1
Show InChI InChI=1S/C36H37N3O4/c1-4-42-24-23-38(34(40)25-27-15-17-29(18-16-27)28-11-7-6-8-12-28)26(3)35-37-33-14-10-9-13-32(33)36(41)39(35)30-19-21-31(22-20-30)43-5-2/h6-22,26H,4-5,23-25H2,1-3H3/t26-/m1/s1
n/an/a 75n/an/an/an/an/an/a
Amgen Inc.
Curated by ChEMBL
Assay Description
Displacement of [125I ]IP10 from CXCR3 receptor expressed in PBMC
Bioorg Med Chem Lett 17: 3339-43 (2007)
Article DOI: 10.1016/j.bmcl.2007.03.106
BindingDB Entry DOI: 10.7270/Q2VT1SXN