BDBM50211143 (R)-N-(1-(3-(4-methoxyphenyl)-4-oxo-3,4-dihydroquinazolin-2-yl)ethyl)-N-(pyridin-3-ylmethyl)-2-(4-(trifluoromethyl)phenyl)acetamide::CHEMBL397678
SMILES: COc1ccc(cc1)-n1c(nc2ccccc2c1=O)[C@@H](C)N(Cc1cccnc1)C(=O)Cc1ccc(cc1)C(F)(F)F
InChI Key: InChIKey=QVFFQNSISGSTSN-OAQYLSRUSA-N
Data: 1 IC50
Activity Spreadsheet -- Enzyme Inhibition Constant Data from BindingDB
Found 1 hit for monomerid = 50211143
Trg + Lig
Ki
nM
ΔG°
kcal/mole
IC50
nM
Kd
nM
EC50/IC50
nM
koff
s-1
kon
M-1s-1
pHTemp
°C
chemokine (C-X-C motif) receptor 3
(Homo sapiens (Human))
BDBM50211143
((R)-N-(1-(3-(4-methoxyphenyl)-4-oxo-3,4-dihydroqui...)
Show SMILES COc1ccc(cc1)-n1c(nc2ccccc2c1=O)[C@@H](C)N(Cc1cccnc1)C(=O)Cc1ccc(cc1)C(F)(F)F
Show InChI InChI=1S/C32H27F3N4O3/c1-21(30-37-28-8-4-3-7-27(28)31(41)39(30)25-13-15-26(42-2)16-14-25)38(20-23-6-5-17-36-19-23)29(40)18-22-9-11-24(12-10-22)32(33,34)35/h3-17,19,21H,18,20H2,1-2H3/t21-/m1/s1
n/an/a 14n/an/an/an/an/an/a
Amgen Inc.
Curated by ChEMBL
Assay Description
Displacement of [125I ]IP10 from CXCR3 receptor expressed in PBMC
Bioorg Med Chem Lett 17: 3339-43 (2007)
Article DOI: 10.1016/j.bmcl.2007.03.106
BindingDB Entry DOI: 10.7270/Q2VT1SXN