BDBM50211192 CHEMBL3969801
SMILES: COc1ccc2nc(NC3=NC[C@]4(CN5CCC4CC5)O3)sc2c1
InChI Key: InChIKey=KIDXXFXVPLATJJ-QGZVFWFLSA-N
Data: 1 IC50  1 EC50
Activity Spreadsheet -- Enzyme Inhibition Constant Data from BindingDB
Found 2 hits for monomerid = 50211192
Trg + Lig
Ki
nM
ΔG°
kcal/mole
IC50
nM
Kd
nM
EC50/IC50
nM
koff
s-1
kon
M-1s-1
pHTemp
°C
Neuronal acetylcholine receptor
(Rattus norvegicus (Rat))
BDBM50211192
(CHEMBL3969801)
Show SMILES COc1ccc2nc(NC3=NC[C@]4(CN5CCC4CC5)O3)sc2c1 |r,wD:12.21,t:9,THB:20:12:15.16:19.18,(37.09,-40.85,;35.6,-40.46,;34.52,-41.55,;34.92,-43.04,;33.83,-44.12,;32.35,-43.73,;31.07,-44.57,;29.87,-43.61,;28.38,-44.01,;27.98,-45.5,;28.96,-46.69,;28.12,-47.99,;26.63,-47.59,;26.93,-49.11,;25.44,-48.42,;23.78,-49.14,;23.56,-47.64,;25.16,-46.94,;25.24,-45.16,;25.72,-46.36,;26.55,-46.05,;30.42,-42.17,;31.96,-42.24,;33.04,-41.16,)|
Show InChI InChI=1S/C17H20N4O2S/c1-22-12-2-3-13-14(8-12)24-16(19-13)20-15-18-9-17(23-15)10-21-6-4-11(17)5-7-21/h2-3,8,11H,4-7,9-10H2,1H3,(H,18,19,20)/t17-/m1/s1
Reactome pathway
n/an/an/an/a 1.90E+3n/an/an/an/a
Bristol-Myers Squibb
Curated by ChEMBL
Assay Description
Agonist activity at rat alpha7 nAChR expressed in HEK293 cells co-expressing human RIC3 measured for 2 mins by FLIPR assay
J Med Chem 59: 11171-11181 (2016)
Article DOI: 10.1021/acs.jmedchem.6b01506
BindingDB Entry DOI: 10.7270/Q2NS0X2H
5-hydroxytryptamine receptor 3A
(Homo sapiens (Human))
BDBM50211192
(CHEMBL3969801)
Show SMILES COc1ccc2nc(NC3=NC[C@]4(CN5CCC4CC5)O3)sc2c1 |r,wD:12.21,t:9,THB:20:12:15.16:19.18,(37.09,-40.85,;35.6,-40.46,;34.52,-41.55,;34.92,-43.04,;33.83,-44.12,;32.35,-43.73,;31.07,-44.57,;29.87,-43.61,;28.38,-44.01,;27.98,-45.5,;28.96,-46.69,;28.12,-47.99,;26.63,-47.59,;26.93,-49.11,;25.44,-48.42,;23.78,-49.14,;23.56,-47.64,;25.16,-46.94,;25.24,-45.16,;25.72,-46.36,;26.55,-46.05,;30.42,-42.17,;31.96,-42.24,;33.04,-41.16,)|
Show InChI InChI=1S/C17H20N4O2S/c1-22-12-2-3-13-14(8-12)24-16(19-13)20-15-18-9-17(23-15)10-21-6-4-11(17)5-7-21/h2-3,8,11H,4-7,9-10H2,1H3,(H,18,19,20)/t17-/m1/s1
Reactome pathway
n/an/a>9.70E+4n/an/an/an/an/an/a
Bristol-Myers Squibb
Curated by ChEMBL
Assay Description
Antagonist activity at human 5-HT3A expressed in HEK293 cells assessed as reduction in acetylcholine-induced activity preincubated for 30 mins follow...
J Med Chem 59: 11171-11181 (2016)
Article DOI: 10.1021/acs.jmedchem.6b01506
BindingDB Entry DOI: 10.7270/Q2NS0X2H