BDBM50211206 CHEMBL3923346
SMILES: C1CN2CC1C1(CN=C(Nc3nc4ccccc4s3)O1)C2
InChI Key: InChIKey=OZMMPPFQKQDOQW-UHFFFAOYSA-N
Data: 1 IC50  1 EC50
Activity Spreadsheet -- Enzyme Inhibition Constant Data from BindingDB
Found 2 hits for monomerid = 50211206
Trg + Lig
Ki
nM
ΔG°
kcal/mole
IC50
nM
Kd
nM
EC50/IC50
nM
koff
s-1
kon
M-1s-1
pHTemp
°C
5-hydroxytryptamine receptor 3A
(Homo sapiens (Human))
BDBM50211206
(CHEMBL3923346)
Show SMILES C1CN2CC1C1(CN=C(Nc3nc4ccccc4s3)O1)C2 |t:8,TLB:6:5:1.0:3,THB:19:5:1.0:3|
Show InChI InChI=1S/C15H16N4OS/c1-2-4-12-11(3-1)17-14(21-12)18-13-16-8-15(20-13)9-19-6-5-10(15)7-19/h1-4,10H,5-9H2,(H,16,17,18)
Reactome pathway
n/an/a 35n/an/an/an/an/an/a
Bristol-Myers Squibb
Curated by ChEMBL
Assay Description
Antagonist activity at human 5-HT3A expressed in HEK293 cells assessed as reduction in acetylcholine-induced activity preincubated for 30 mins follow...
J Med Chem 59: 11171-11181 (2016)
Article DOI: 10.1021/acs.jmedchem.6b01506
BindingDB Entry DOI: 10.7270/Q2NS0X2H
Neuronal acetylcholine receptor
(Rattus norvegicus (Rat))
BDBM50211206
(CHEMBL3923346)
Show SMILES C1CN2CC1C1(CN=C(Nc3nc4ccccc4s3)O1)C2 |t:8,TLB:6:5:1.0:3,THB:19:5:1.0:3|
Show InChI InChI=1S/C15H16N4OS/c1-2-4-12-11(3-1)17-14(21-12)18-13-16-8-15(20-13)9-19-6-5-10(15)7-19/h1-4,10H,5-9H2,(H,16,17,18)
Reactome pathway
n/an/an/an/a 260n/an/an/an/a
Bristol-Myers Squibb
Curated by ChEMBL
Assay Description
Agonist activity at rat alpha7 nAChR expressed in HEK293 cells co-expressing human RIC3 measured for 2 mins by FLIPR assay
J Med Chem 59: 11171-11181 (2016)
Article DOI: 10.1021/acs.jmedchem.6b01506
BindingDB Entry DOI: 10.7270/Q2NS0X2H