BDBM50211210 CHEMBL3984925
SMILES: C1N=C(Nc2ccc3ccccc3n2)O[C@]11CN2CCC1CC2
InChI Key: InChIKey=KLCVWZMJNQGSJE-SFHVURJKSA-N
Data: 1 IC50  1 EC50
Activity Spreadsheet -- Enzyme Inhibition Constant Data from BindingDB
Found 2 hits for monomerid = 50211210
Trg + Lig
Ki
nM
ΔG°
kcal/mole
IC50
nM
Kd
nM
EC50/IC50
nM
koff
s-1
kon
M-1s-1
pHTemp
°C
5-hydroxytryptamine receptor 3A
(Homo sapiens (Human))
BDBM50211210
(CHEMBL3984925)
Show SMILES C1N=C(Nc2ccc3ccccc3n2)O[C@]11CN2CCC1CC2 |r,wU:15.16,t:1,THB:14:15:18.19:22.21,(48.06,-43.88,;48.9,-42.58,;47.93,-41.39,;48.32,-39.9,;49.81,-39.5,;50.19,-38.02,;51.67,-37.61,;52.77,-38.7,;54.25,-38.3,;55.34,-39.38,;54.95,-40.88,;53.46,-41.27,;52.37,-40.19,;50.89,-40.59,;46.49,-41.94,;46.57,-43.48,;46.88,-45,;45.38,-44.31,;43.72,-45.03,;43.51,-43.53,;45.11,-42.83,;45.18,-41.05,;45.66,-42.26,)|
Show InChI InChI=1S/C18H20N4O/c1-2-4-15-13(3-1)5-6-16(20-15)21-17-19-11-18(23-17)12-22-9-7-14(18)8-10-22/h1-6,14H,7-12H2,(H,19,20,21)/t18-/m0/s1
Reactome pathway
n/an/a 8n/an/an/an/an/an/a
Bristol-Myers Squibb
Curated by ChEMBL
Assay Description
Antagonist activity at human 5-HT3A expressed in HEK293 cells assessed as reduction in acetylcholine-induced activity preincubated for 30 mins follow...
J Med Chem 59: 11171-11181 (2016)
Article DOI: 10.1021/acs.jmedchem.6b01506
BindingDB Entry DOI: 10.7270/Q2NS0X2H
Neuronal acetylcholine receptor
(Rattus norvegicus (Rat))
BDBM50211210
(CHEMBL3984925)
Show SMILES C1N=C(Nc2ccc3ccccc3n2)O[C@]11CN2CCC1CC2 |r,wU:15.16,t:1,THB:14:15:18.19:22.21,(48.06,-43.88,;48.9,-42.58,;47.93,-41.39,;48.32,-39.9,;49.81,-39.5,;50.19,-38.02,;51.67,-37.61,;52.77,-38.7,;54.25,-38.3,;55.34,-39.38,;54.95,-40.88,;53.46,-41.27,;52.37,-40.19,;50.89,-40.59,;46.49,-41.94,;46.57,-43.48,;46.88,-45,;45.38,-44.31,;43.72,-45.03,;43.51,-43.53,;45.11,-42.83,;45.18,-41.05,;45.66,-42.26,)|
Show InChI InChI=1S/C18H20N4O/c1-2-4-15-13(3-1)5-6-16(20-15)21-17-19-11-18(23-17)12-22-9-7-14(18)8-10-22/h1-6,14H,7-12H2,(H,19,20,21)/t18-/m0/s1
Reactome pathway
n/an/an/an/a 26n/an/an/an/a
Bristol-Myers Squibb
Curated by ChEMBL
Assay Description
Agonist activity at rat alpha7 nAChR expressed in HEK293 cells co-expressing human RIC3 measured for 2 mins by FLIPR assay
J Med Chem 59: 11171-11181 (2016)
Article DOI: 10.1021/acs.jmedchem.6b01506
BindingDB Entry DOI: 10.7270/Q2NS0X2H