BDBM50211211 CHEMBL3902912
SMILES: C1N=C(Nc2nccs2)OC11CN2CCC1CC2
InChI Key: InChIKey=YKBNMVULSUSZJK-UHFFFAOYSA-N
Data: 1 IC50  2 EC50
Activity Spreadsheet -- Enzyme Inhibition Constant Data from BindingDB
Found 3 hits for monomerid = 50211211
Trg + Lig
Ki
nM
ΔG°
kcal/mole
IC50
nM
Kd
nM
EC50/IC50
nM
koff
s-1
kon
M-1s-1
pHTemp
°C
5-hydroxytryptamine receptor 3A
(Homo sapiens (Human))
BDBM50211211
(CHEMBL3902912)
Show SMILES C1N=C(Nc2nccs2)OC11CN2CCC1CC2 |t:1,THB:9:10:13.14:17.16,(7.52,-18.74,;8.35,-17.45,;7.38,-16.26,;7.78,-14.77,;9.26,-14.37,;10.47,-15.33,;11.76,-14.49,;11.35,-13,;9.82,-12.93,;5.94,-16.81,;6.03,-18.35,;6.33,-19.87,;4.84,-19.18,;3.18,-19.9,;2.96,-18.39,;4.56,-17.7,;4.64,-15.92,;5.11,-17.12,)|
Show InChI InChI=1S/C12H16N4OS/c1-4-16-5-2-9(1)12(8-16)7-14-10(17-12)15-11-13-3-6-18-11/h3,6,9H,1-2,4-5,7-8H2,(H,13,14,15)
Reactome pathway
n/an/a 25n/an/an/an/an/an/a
Bristol-Myers Squibb
Curated by ChEMBL
Assay Description
Antagonist activity at human 5-HT3A expressed in HEK293 cells assessed as reduction in acetylcholine-induced activity preincubated for 30 mins follow...
J Med Chem 59: 11171-11181 (2016)
Article DOI: 10.1021/acs.jmedchem.6b01506
BindingDB Entry DOI: 10.7270/Q2NS0X2H
Neuronal acetylcholine receptor
(Rattus norvegicus (Rat))
BDBM50211211
(CHEMBL3902912)
Show SMILES C1N=C(Nc2nccs2)OC11CN2CCC1CC2 |t:1,THB:9:10:13.14:17.16,(7.52,-18.74,;8.35,-17.45,;7.38,-16.26,;7.78,-14.77,;9.26,-14.37,;10.47,-15.33,;11.76,-14.49,;11.35,-13,;9.82,-12.93,;5.94,-16.81,;6.03,-18.35,;6.33,-19.87,;4.84,-19.18,;3.18,-19.9,;2.96,-18.39,;4.56,-17.7,;4.64,-15.92,;5.11,-17.12,)|
Show InChI InChI=1S/C12H16N4OS/c1-4-16-5-2-9(1)12(8-16)7-14-10(17-12)15-11-13-3-6-18-11/h3,6,9H,1-2,4-5,7-8H2,(H,13,14,15)
Reactome pathway
n/an/an/an/a 200n/an/an/an/a
Bristol-Myers Squibb
Curated by ChEMBL
Assay Description
Agonist activity at rat alpha7 nAChR expressed in HEK293 cells co-expressing human RIC3 measured for 2 mins by FLIPR assay
J Med Chem 59: 11171-11181 (2016)
Article DOI: 10.1021/acs.jmedchem.6b01506
BindingDB Entry DOI: 10.7270/Q2NS0X2H
Neuronal acetylcholine receptor
(Rattus norvegicus (Rat))
BDBM50211211
(CHEMBL3902912)
Show SMILES C1N=C(Nc2nccs2)OC11CN2CCC1CC2 |t:1,THB:9:10:13.14:17.16,(7.52,-18.74,;8.35,-17.45,;7.38,-16.26,;7.78,-14.77,;9.26,-14.37,;10.47,-15.33,;11.76,-14.49,;11.35,-13,;9.82,-12.93,;5.94,-16.81,;6.03,-18.35,;6.33,-19.87,;4.84,-19.18,;3.18,-19.9,;2.96,-18.39,;4.56,-17.7,;4.64,-15.92,;5.11,-17.12,)|
Show InChI InChI=1S/C12H16N4OS/c1-4-16-5-2-9(1)12(8-16)7-14-10(17-12)15-11-13-3-6-18-11/h3,6,9H,1-2,4-5,7-8H2,(H,13,14,15)
Reactome pathway
n/an/an/an/a 1.30E+3n/an/an/an/a
Bristol-Myers Squibb
Curated by ChEMBL
Assay Description
Partial agonist activity at rat alpha7 nAChR expressed in HEK293 cells co-expressing human RIC3 at holding potential of -90 mV by whole-cell voltage ...
J Med Chem 59: 11171-11181 (2016)
Article DOI: 10.1021/acs.jmedchem.6b01506
BindingDB Entry DOI: 10.7270/Q2NS0X2H