BDBM50211213 CHEMBL3927478
SMILES: Clc1ccc2nc(NC3=NCC4(CN5CCC4CC5)O3)sc2c1
InChI Key: InChIKey=JFPMKTAXLLHMRR-UHFFFAOYSA-N
Data: 1 IC50  1 EC50
Activity Spreadsheet -- Enzyme Inhibition Constant Data from BindingDB
Found 2 hits for monomerid = 50211213
Trg + Lig
Ki
nM
ΔG°
kcal/mole
IC50
nM
Kd
nM
EC50/IC50
nM
koff
s-1
kon
M-1s-1
pHTemp
°C
Neuronal acetylcholine receptor
(Rattus norvegicus (Rat))
BDBM50211213
(CHEMBL3927478)
Show SMILES Clc1ccc2nc(NC3=NCC4(CN5CCC4CC5)O3)sc2c1 |t:8,THB:19:11:14.15:18.17,(70.55,-22.03,;69.46,-23.12,;69.87,-24.61,;68.78,-25.69,;67.3,-25.29,;66.02,-26.14,;64.82,-25.17,;63.33,-25.58,;62.93,-27.06,;63.91,-28.26,;63.07,-29.55,;61.58,-29.16,;61.88,-30.68,;60.39,-29.99,;58.73,-30.71,;58.51,-29.2,;60.11,-28.51,;60.19,-26.72,;60.67,-27.93,;61.5,-27.62,;65.37,-23.73,;66.91,-23.81,;67.99,-22.73,)|
Show InChI InChI=1S/C16H17ClN4OS/c17-11-1-2-12-13(7-11)23-15(19-12)20-14-18-8-16(22-14)9-21-5-3-10(16)4-6-21/h1-2,7,10H,3-6,8-9H2,(H,18,19,20)
Reactome pathway
n/an/an/an/a 150n/an/an/an/a
Bristol-Myers Squibb
Curated by ChEMBL
Assay Description
Agonist activity at rat alpha7 nAChR expressed in HEK293 cells co-expressing human RIC3 measured for 2 mins by FLIPR assay
J Med Chem 59: 11171-11181 (2016)
Article DOI: 10.1021/acs.jmedchem.6b01506
BindingDB Entry DOI: 10.7270/Q2NS0X2H
5-hydroxytryptamine receptor 3A
(Homo sapiens (Human))
BDBM50211213
(CHEMBL3927478)
Show SMILES Clc1ccc2nc(NC3=NCC4(CN5CCC4CC5)O3)sc2c1 |t:8,THB:19:11:14.15:18.17,(70.55,-22.03,;69.46,-23.12,;69.87,-24.61,;68.78,-25.69,;67.3,-25.29,;66.02,-26.14,;64.82,-25.17,;63.33,-25.58,;62.93,-27.06,;63.91,-28.26,;63.07,-29.55,;61.58,-29.16,;61.88,-30.68,;60.39,-29.99,;58.73,-30.71,;58.51,-29.2,;60.11,-28.51,;60.19,-26.72,;60.67,-27.93,;61.5,-27.62,;65.37,-23.73,;66.91,-23.81,;67.99,-22.73,)|
Show InChI InChI=1S/C16H17ClN4OS/c17-11-1-2-12-13(7-11)23-15(19-12)20-14-18-8-16(22-14)9-21-5-3-10(16)4-6-21/h1-2,7,10H,3-6,8-9H2,(H,18,19,20)
Reactome pathway
n/an/a 8.10E+3n/an/an/an/an/an/a
Bristol-Myers Squibb
Curated by ChEMBL
Assay Description
Antagonist activity at human 5-HT3A expressed in HEK293 cells assessed as reduction in acetylcholine-induced activity preincubated for 30 mins follow...
J Med Chem 59: 11171-11181 (2016)
Article DOI: 10.1021/acs.jmedchem.6b01506
BindingDB Entry DOI: 10.7270/Q2NS0X2H