BDBM50211226 CHEMBL3906886
SMILES: CN1CCN(Cc2ccc(cc2C(F)(F)F)C(=O)Nc2ccc(C)c(OC3CCN(CC3)C(=O)c3cnccc3C)c2)CC1
InChI Key: InChIKey=OCUCMFCBWXLQQI-UHFFFAOYSA-N
Data: 2 IC50
Activity Spreadsheet -- Enzyme Inhibition Constant Data from BindingDB
Found 2 hits for monomerid = 50211226
Trg + Lig
Ki
nM
ΔG°
kcal/mole
IC50
nM
Kd
nM
EC50/IC50
nM
koff
s-1
kon
M-1s-1
pHTemp
°C
Tyrosine-protein kinase ABL1
(Homo sapiens (Human))
BDBM50211226
(CHEMBL3906886)
Show SMILES CN1CCN(Cc2ccc(cc2C(F)(F)F)C(=O)Nc2ccc(C)c(OC3CCN(CC3)C(=O)c3cnccc3C)c2)CC1
Show InChI InChI=1S/C33H38F3N5O3/c1-22-8-11-37-20-28(22)32(43)41-12-9-27(10-13-41)44-30-19-26(7-4-23(30)2)38-31(42)24-5-6-25(29(18-24)33(34,35)36)21-40-16-14-39(3)15-17-40/h4-8,11,18-20,27H,9-10,12-17,21H2,1-3H3,(H,38,42)
Reactome pathway
n/an/a 7.25E+3n/an/an/an/an/an/a
High Magnetic Field Laboratory
Curated by ChEMBL
Assay Description
Inhibition of C-terminal His-tagged human ABL1 expressed in baculovirus infected SF9 cells using Tyr 02 peptide as substrate measured after 1 hr by F...
J Med Chem 60: 273-289 (2017)
Article DOI: 10.1021/acs.jmedchem.6b01290
BindingDB Entry DOI: 10.7270/Q2J10591
Mast/stem cell growth factor receptor Kit
(Homo sapiens (Human))
BDBM50211226
(CHEMBL3906886)
Show SMILES CN1CCN(Cc2ccc(cc2C(F)(F)F)C(=O)Nc2ccc(C)c(OC3CCN(CC3)C(=O)c3cnccc3C)c2)CC1
Show InChI InChI=1S/C33H38F3N5O3/c1-22-8-11-37-20-28(22)32(43)41-12-9-27(10-13-41)44-30-19-26(7-4-23(30)2)38-31(42)24-5-6-25(29(18-24)33(34,35)36)21-40-16-14-39(3)15-17-40/h4-8,11,18-20,27H,9-10,12-17,21H2,1-3H3,(H,38,42)
n/an/a 336n/an/an/an/an/an/a
High Magnetic Field Laboratory
Curated by ChEMBL
Assay Description
Inhibition of recombinant C-terminal polyhistidine-tagged human c-KIT expressed in mammalian expression system using Tyr 06 peptide as substrate meas...
J Med Chem 60: 273-289 (2017)
Article DOI: 10.1021/acs.jmedchem.6b01290
BindingDB Entry DOI: 10.7270/Q2J10591