BDBM50211227 CHEMBL3894450
SMILES: CN1CCN(Cc2ccc(cc2C(F)(F)F)C(=O)Nc2ccc(C)c(OC3CCN(CC3)C(=O)c3ccncc3)c2)CC1
InChI Key: InChIKey=GKVWMMLQQGMAMC-UHFFFAOYSA-N
Data: 2 IC50
Activity Spreadsheet -- Enzyme Inhibition Constant Data from BindingDB
Found 2 hits for monomerid = 50211227
Trg + Lig
Ki
nM
ΔG°
kcal/mole
IC50
nM
Kd
nM
EC50/IC50
nM
koff
s-1
kon
M-1s-1
pHTemp
°C
Mast/stem cell growth factor receptor Kit
(Homo sapiens (Human))
BDBM50211227
(CHEMBL3894450)
Show SMILES CN1CCN(Cc2ccc(cc2C(F)(F)F)C(=O)Nc2ccc(C)c(OC3CCN(CC3)C(=O)c3ccncc3)c2)CC1
Show InChI InChI=1S/C32H36F3N5O3/c1-22-3-6-26(20-29(22)43-27-9-13-40(14-10-27)31(42)23-7-11-36-12-8-23)37-30(41)24-4-5-25(28(19-24)32(33,34)35)21-39-17-15-38(2)16-18-39/h3-8,11-12,19-20,27H,9-10,13-18,21H2,1-2H3,(H,37,41)
n/an/a 256n/an/an/an/an/an/a
High Magnetic Field Laboratory
Curated by ChEMBL
Assay Description
Inhibition of recombinant C-terminal polyhistidine-tagged human c-KIT expressed in mammalian expression system using Tyr 06 peptide as substrate meas...
J Med Chem 60: 273-289 (2017)
Article DOI: 10.1021/acs.jmedchem.6b01290
BindingDB Entry DOI: 10.7270/Q2J10591
Tyrosine-protein kinase ABL1
(Homo sapiens (Human))
BDBM50211227
(CHEMBL3894450)
Show SMILES CN1CCN(Cc2ccc(cc2C(F)(F)F)C(=O)Nc2ccc(C)c(OC3CCN(CC3)C(=O)c3ccncc3)c2)CC1
Show InChI InChI=1S/C32H36F3N5O3/c1-22-3-6-26(20-29(22)43-27-9-13-40(14-10-27)31(42)23-7-11-36-12-8-23)37-30(41)24-4-5-25(28(19-24)32(33,34)35)21-39-17-15-38(2)16-18-39/h3-8,11-12,19-20,27H,9-10,13-18,21H2,1-2H3,(H,37,41)
Reactome pathway
n/an/a 7n/an/an/an/an/an/a
High Magnetic Field Laboratory
Curated by ChEMBL
Assay Description
Inhibition of C-terminal His-tagged human ABL1 expressed in baculovirus infected SF9 cells using Tyr 02 peptide as substrate measured after 1 hr by F...
J Med Chem 60: 273-289 (2017)
Article DOI: 10.1021/acs.jmedchem.6b01290
BindingDB Entry DOI: 10.7270/Q2J10591