BDBM50211237 CHEMBL3929394
SMILES: OC(C1CCCCC1)(C1CCCCC1)c1cnn(n1)C(=O)N1CCCCC1Cc1ccccc1
InChI Key: InChIKey=LPDBAMMMZZZFNO-UHFFFAOYSA-N
Data: 2 IC50
Activity Spreadsheet -- Enzyme Inhibition Constant Data from BindingDB
Found 2 hits for monomerid = 50211237
Trg + Lig
Ki
nM
ΔG°
kcal/mole
IC50
nM
Kd
nM
EC50/IC50
nM
koff
s-1
kon
M-1s-1
pHTemp
°C
Monoacylglycerol lipase ABHD6
(Homo sapiens (Human))
BDBM50211237
(CHEMBL3929394)
Show SMILES OC(C1CCCCC1)(C1CCCCC1)c1cnn(n1)C(=O)N1CCCCC1Cc1ccccc1
Show InChI InChI=1S/C28H40N4O2/c33-27(31-19-11-10-18-25(31)20-22-12-4-1-5-13-22)32-29-21-26(30-32)28(34,23-14-6-2-7-15-23)24-16-8-3-9-17-24/h1,4-5,12-13,21,23-25,34H,2-3,6-11,14-20H2
n/an/a 7.94E+3n/an/an/an/an/an/a
Leiden University
Curated by ChEMBL
Assay Description
Inhibition of human ABHD6 using 2-AG as natural substrate by fluorescence based assay
J Med Chem 60: 428-440 (2017)
Article DOI: 10.1021/acs.jmedchem.6b01482
BindingDB Entry DOI: 10.7270/Q28K7C79
Sn1-specific diacylglycerol lipase alpha
(Homo sapiens (Human))
BDBM50211237
(CHEMBL3929394)
Show SMILES OC(C1CCCCC1)(C1CCCCC1)c1cnn(n1)C(=O)N1CCCCC1Cc1ccccc1
Show InChI InChI=1S/C28H40N4O2/c33-27(31-19-11-10-18-25(31)20-22-12-4-1-5-13-22)32-29-21-26(30-32)28(34,23-14-6-2-7-15-23)24-16-8-3-9-17-24/h1,4-5,12-13,21,23-25,34H,2-3,6-11,14-20H2
NCI pathway
Reactome pathway
n/an/a 100n/an/an/an/an/an/a
Leiden University
Curated by ChEMBL
Assay Description
Inhibition of recombinant human DAGLalpha expressed in HEK293T cell membranes overexpressing MAGL using natural substrate 1-stearoyl-2-arachidonoly-s...
J Med Chem 60: 428-440 (2017)
Article DOI: 10.1021/acs.jmedchem.6b01482
BindingDB Entry DOI: 10.7270/Q28K7C79