BDBM50211244 CHEMBL395926::Trimethyl-[2-(7-oxo-7H-1-aza-benzo[de]anthracen-9-ylcarbamoyl)-ethyl]-ammonium methiodide::trimethyl-[2-(7-oxo-7H-1-aza-benzo[de]anthracen-9-ylcarbamoyl)-ethyl]-ammonium
SMILES: C[N+](C)(C)CCC(=O)Nc1ccc-2c(c1)C(=O)c1cccc3ccnc-2c13
InChI Key: InChIKey=ZOBLVFXUVZGOLQ-UHFFFAOYSA-O
Data: 4 IC50
Activity Spreadsheet -- Enzyme Inhibition Constant Data from BindingDB
Found 4 hits for monomerid = 50211244
Trg + Lig
Ki
nM
ΔG°
kcal/mole
IC50
nM
Kd
nM
EC50/IC50
nM
koff
s-1
kon
M-1s-1
pHTemp
°C
Acetylcholinesterase
(Electrophorus electricus (Electric eel))
BDBM50211244
(CHEMBL395926 | Trimethyl-[2-(7-oxo-7H-1-aza-benzo[...)
Show SMILES C[N+](C)(C)CCC(=O)Nc1ccc-2c(c1)C(=O)c1cccc3ccnc-2c13
Show InChI InChI=1S/C22H21N3O2/c1-25(2,3)12-10-19(26)24-15-7-8-16-18(13-15)22(27)17-6-4-5-14-9-11-23-21(16)20(14)17/h4-9,11,13H,10,12H2,1-3H3/p+1
n/an/a 4.81n/an/an/an/an/an/a
Sun Yat-sen University
Curated by ChEMBL
Assay Description
Inhibition of electric eel AChE by Ellman's method
Eur J Med Chem 44: 2523-32 (2009)
Article DOI: 10.1016/j.ejmech.2009.01.021
BindingDB Entry DOI: 10.7270/Q2Z89CFV
Butyrylcholinesterase (BChE)
(Equus caballus (Horse))
BDBM50211244
(CHEMBL395926 | Trimethyl-[2-(7-oxo-7H-1-aza-benzo[...)
Show SMILES C[N+](C)(C)CCC(=O)Nc1ccc-2c(c1)C(=O)c1cccc3ccnc-2c13
Show InChI InChI=1S/C22H21N3O2/c1-25(2,3)12-10-19(26)24-15-7-8-16-18(13-15)22(27)17-6-4-5-14-9-11-23-21(16)20(14)17/h4-9,11,13H,10,12H2,1-3H3/p+1
n/an/a 2.82E+3n/an/an/an/an/an/a
Sun Yat-Sen University
Curated by ChEMBL
Assay Description
Inhibition of equine serum BuChE
Bioorg Med Chem Lett 17: 3765-8 (2007)
Article DOI: 10.1016/j.bmcl.2007.04.015
BindingDB Entry DOI: 10.7270/Q28C9X2C
Acetylcholinesterase
(Electrophorus electricus (Electric eel))
BDBM50211244
(CHEMBL395926 | Trimethyl-[2-(7-oxo-7H-1-aza-benzo[...)
Show SMILES C[N+](C)(C)CCC(=O)Nc1ccc-2c(c1)C(=O)c1cccc3ccnc-2c13
Show InChI InChI=1S/C22H21N3O2/c1-25(2,3)12-10-19(26)24-15-7-8-16-18(13-15)22(27)17-6-4-5-14-9-11-23-21(16)20(14)17/h4-9,11,13H,10,12H2,1-3H3/p+1
n/an/a 4.81n/an/an/an/an/an/a
Sun Yat-Sen University
Curated by ChEMBL
Assay Description
Inhibition of electric eel AChE
Bioorg Med Chem Lett 17: 3765-8 (2007)
Article DOI: 10.1016/j.bmcl.2007.04.015
BindingDB Entry DOI: 10.7270/Q28C9X2C
Butyrylcholinesterase (BuChE)
(Equus caballus (Horse))
BDBM50211244
(CHEMBL395926 | Trimethyl-[2-(7-oxo-7H-1-aza-benzo[...)
Show SMILES C[N+](C)(C)CCC(=O)Nc1ccc-2c(c1)C(=O)c1cccc3ccnc-2c13
Show InChI InChI=1S/C22H21N3O2/c1-25(2,3)12-10-19(26)24-15-7-8-16-18(13-15)22(27)17-6-4-5-14-9-11-23-21(16)20(14)17/h4-9,11,13H,10,12H2,1-3H3/p+1
n/an/a 2.82E+3n/an/an/an/an/an/a
Sun Yat-sen University
Curated by ChEMBL
Assay Description
Inhibition of equine serum BuChE by Ellman's method
Eur J Med Chem 44: 2523-32 (2009)
Article DOI: 10.1016/j.ejmech.2009.01.021
BindingDB Entry DOI: 10.7270/Q2Z89CFV