BDBM50211259 CHEMBL3934441
SMILES: O=C(N1CCCC[C@H]1Cc1ccccc1)n1cc(nn1)-c1ccc(cc1)-c1ccccc1
InChI Key: InChIKey=JKJMWHULJIOKPJ-VWLOTQADSA-N
Data: 4 IC50
Activity Spreadsheet -- Enzyme Inhibition Constant Data from BindingDB
Found 4 hits for monomerid = 50211259
Trg + Lig
Ki
nM
ΔG°
kcal/mole
IC50
nM
Kd
nM
EC50/IC50
nM
koff
s-1
kon
M-1s-1
pHTemp
°C
Monoacylglycerol lipase ABHD6
(Homo sapiens (Human))
BDBM50211259
(CHEMBL3934441)
Show SMILES O=C(N1CCCC[C@H]1Cc1ccccc1)n1cc(nn1)-c1ccc(cc1)-c1ccccc1 |r|
Show InChI InChI=1S/C27H26N4O/c32-27(30-18-8-7-13-25(30)19-21-9-3-1-4-10-21)31-20-26(28-29-31)24-16-14-23(15-17-24)22-11-5-2-6-12-22/h1-6,9-12,14-17,20,25H,7-8,13,18-19H2/t25-/m0/s1
n/an/a 631n/an/an/an/an/an/a
Leiden University
Curated by ChEMBL
Assay Description
Inhibition of human ABHD6 using 2-AG as natural substrate by fluorescence based assay
J Med Chem 60: 428-440 (2017)
Article DOI: 10.1021/acs.jmedchem.6b01482
BindingDB Entry DOI: 10.7270/Q28K7C79
Sn1-specific diacylglycerol lipase alpha
(Homo sapiens (Human))
BDBM50211259
(CHEMBL3934441)
Show SMILES O=C(N1CCCC[C@H]1Cc1ccccc1)n1cc(nn1)-c1ccc(cc1)-c1ccccc1 |r|
Show InChI InChI=1S/C27H26N4O/c32-27(30-18-8-7-13-25(30)19-21-9-3-1-4-10-21)31-20-26(28-29-31)24-16-14-23(15-17-24)22-11-5-2-6-12-22/h1-6,9-12,14-17,20,25H,7-8,13,18-19H2/t25-/m0/s1
NCI pathway
Reactome pathway
n/an/a 794n/an/an/an/an/an/a
Leiden University
Curated by ChEMBL
Assay Description
Inhibition of recombinant human DAGLalpha expressed in HEK293T cell membranes overexpressing MAGL using natural substrate 1-stearoyl-2-arachidonoly-s...
J Med Chem 60: 428-440 (2017)
Article DOI: 10.1021/acs.jmedchem.6b01482
BindingDB Entry DOI: 10.7270/Q28K7C79
Sn1-specific diacylglycerol lipase alpha
(Homo sapiens (Human))
BDBM50211259
(CHEMBL3934441)
Show SMILES O=C(N1CCCC[C@H]1Cc1ccccc1)n1cc(nn1)-c1ccc(cc1)-c1ccccc1 |r|
Show InChI InChI=1S/C27H26N4O/c32-27(30-18-8-7-13-25(30)19-21-9-3-1-4-10-21)31-20-26(28-29-31)24-16-14-23(15-17-24)22-11-5-2-6-12-22/h1-6,9-12,14-17,20,25H,7-8,13,18-19H2/t25-/m0/s1
NCI pathway
Reactome pathway
n/an/a 40n/an/an/an/an/an/a
Leiden University
Curated by ChEMBL
Assay Description
Inhibition of recombinant human DAGLalpha expressed in HEK293T cell membranes overexpressing MAGL using natural substrate 1-stearoyl-2-arachidonoly-s...
J Med Chem 60: 428-440 (2017)
Article DOI: 10.1021/acs.jmedchem.6b01482
BindingDB Entry DOI: 10.7270/Q28K7C79
Sn1-specific diacylglycerol lipase alpha
(Mus musculus)
BDBM50211259
(CHEMBL3934441)
Show SMILES O=C(N1CCCC[C@H]1Cc1ccccc1)n1cc(nn1)-c1ccc(cc1)-c1ccccc1 |r|
Show InChI InChI=1S/C27H26N4O/c32-27(30-18-8-7-13-25(30)19-21-9-3-1-4-10-21)31-20-26(28-29-31)24-16-14-23(15-17-24)22-11-5-2-6-12-22/h1-6,9-12,14-17,20,25H,7-8,13,18-19H2/t25-/m0/s1
n/an/a 631n/an/an/an/an/an/a
Leiden University
Curated by ChEMBL
Assay Description
Inhibition of MB064 probe binding to DAGLalpha in mouse brain membrane proteome preincubated for 30 mins followed by MB064 probe addition measured af...
J Med Chem 60: 428-440 (2017)
Article DOI: 10.1021/acs.jmedchem.6b01482
BindingDB Entry DOI: 10.7270/Q28K7C79