BDBM50211649 3-(4-(4-((1-(2-chlorophenyl)ethoxy)carbonyl)isoxazol-3-yl)benzylthio)propanoic acid::CHEMBL246929
SMILES: CC(OC(=O)Nc1conc1-c1ccc(CSCCC(O)=O)cc1)c1ccccc1Cl
InChI Key: InChIKey=SDOSDDJQFQQVLN-UHFFFAOYSA-N
Data: 2 IC50
Activity Spreadsheet -- Enzyme Inhibition Constant Data from BindingDB
Found 2 hits for monomerid = 50211649
Trg + Lig
Ki
nM
ΔG°
kcal/mole
IC50
nM
Kd
nM
EC50/IC50
nM
koff
s-1
kon
M-1s-1
pHTemp
°C
Lysophosphatidic acid receptor 1
(Homo sapiens (Human))
BDBM50211649
(3-(4-(4-((1-(2-chlorophenyl)ethoxy)carbonyl)isoxaz...)
Show SMILES CC(OC(=O)Nc1conc1-c1ccc(CSCCC(O)=O)cc1)c1ccccc1Cl
Show InChI InChI=1S/C22H21ClN2O5S/c1-14(17-4-2-3-5-18(17)23)30-22(28)24-19-12-29-25-21(19)16-8-6-15(7-9-16)13-31-11-10-20(26)27/h2-9,12,14H,10-11,13H2,1H3,(H,24,28)(H,26,27)
n/an/a 220n/an/an/an/an/an/a
Ajinomoto Company Inc.
Curated by ChEMBL
Assay Description
Antagonist activity at human recombinant LPA1 receptor expressed in CHOK1 cells assessed as inhibition of lysophosphatidic acid-induced intracellular...
Bioorg Med Chem Lett 17: 3736-40 (2007)
Article DOI: 10.1016/j.bmcl.2007.04.024
BindingDB Entry DOI: 10.7270/Q2CZ36T2
Lysophosphatidic acid receptor 1/lysophosphatidic acid receptor 3
(Rattus norvegicus)
BDBM50211649
(3-(4-(4-((1-(2-chlorophenyl)ethoxy)carbonyl)isoxaz...)
Show SMILES CC(OC(=O)Nc1conc1-c1ccc(CSCCC(O)=O)cc1)c1ccccc1Cl
Show InChI InChI=1S/C22H21ClN2O5S/c1-14(17-4-2-3-5-18(17)23)30-22(28)24-19-12-29-25-21(19)16-8-6-15(7-9-16)13-31-11-10-20(26)27/h2-9,12,14H,10-11,13H2,1H3,(H,24,28)(H,26,27)
Reactome pathway
n/an/a 48n/an/an/an/an/an/a
Ajinomoto Company Inc.
Curated by ChEMBL
Assay Description
Antagonist activity at LPA1 receptor in rat hepatic stellate cells assessed as inhibition of lysophosphatidic acid-induced intracellular calcium infl...
Bioorg Med Chem Lett 17: 3736-40 (2007)
Article DOI: 10.1016/j.bmcl.2007.04.024
BindingDB Entry DOI: 10.7270/Q2CZ36T2