BDBM50211655 4-(4-(4-((1-(2-chlorophenyl)ethoxy)carbonyl)isoxazol-3-yl)phenylamino)-4-oxobutanoic acid::CHEMBL246735
SMILES: CC(OC(=O)Nc1conc1-c1ccc(NC(=O)CCC(O)=O)cc1)c1ccccc1Cl
InChI Key: InChIKey=OMOMFBJGKABUGF-UHFFFAOYSA-N
Data: 2 IC50
Activity Spreadsheet -- Enzyme Inhibition Constant Data from BindingDB
Found 2 hits for monomerid = 50211655
Trg + Lig
Ki
nM
ΔG°
kcal/mole
IC50
nM
Kd
nM
EC50/IC50
nM
koff
s-1
kon
M-1s-1
pHTemp
°C
Lysophosphatidic acid receptor 1/lysophosphatidic acid receptor 3
(Rattus norvegicus)
BDBM50211655
(4-(4-(4-((1-(2-chlorophenyl)ethoxy)carbonyl)isoxaz...)
Show SMILES CC(OC(=O)Nc1conc1-c1ccc(NC(=O)CCC(O)=O)cc1)c1ccccc1Cl
Show InChI InChI=1S/C22H20ClN3O6/c1-13(16-4-2-3-5-17(16)23)32-22(30)25-18-12-31-26-21(18)14-6-8-15(9-7-14)24-19(27)10-11-20(28)29/h2-9,12-13H,10-11H2,1H3,(H,24,27)(H,25,30)(H,28,29)
Reactome pathway
n/an/a 73n/an/an/an/an/an/a
Ajinomoto Company Inc.
Curated by ChEMBL
Assay Description
Antagonist activity at LPA1 receptor in rat hepatic stellate cells assessed as inhibition of lysophosphatidic acid-induced intracellular calcium infl...
Bioorg Med Chem Lett 17: 3736-40 (2007)
Article DOI: 10.1016/j.bmcl.2007.04.024
BindingDB Entry DOI: 10.7270/Q2CZ36T2
Lysophosphatidic acid receptor 1
(Homo sapiens (Human))
BDBM50211655
(4-(4-(4-((1-(2-chlorophenyl)ethoxy)carbonyl)isoxaz...)
Show SMILES CC(OC(=O)Nc1conc1-c1ccc(NC(=O)CCC(O)=O)cc1)c1ccccc1Cl
Show InChI InChI=1S/C22H20ClN3O6/c1-13(16-4-2-3-5-17(16)23)32-22(30)25-18-12-31-26-21(18)14-6-8-15(9-7-14)24-19(27)10-11-20(28)29/h2-9,12-13H,10-11H2,1H3,(H,24,27)(H,25,30)(H,28,29)
n/an/a 140n/an/an/an/an/an/a
Ajinomoto Company Inc.
Curated by ChEMBL
Assay Description
Antagonist activity at human recombinant LPA1 receptor expressed in CHOK1 cells assessed as inhibition of lysophosphatidic acid-induced intracellular...
Bioorg Med Chem Lett 17: 3736-40 (2007)
Article DOI: 10.1016/j.bmcl.2007.04.024
BindingDB Entry DOI: 10.7270/Q2CZ36T2