null
SMILES: NCCO.COc1ccc2ccc(CCc3c([nH]c(=O)[nH]c3=O)C(O)=O)cc2c1
InChI Key: InChIKey=BIZXBPHEWFJZCA-UHFFFAOYSA-N
Activity Spreadsheet -- Enzyme Inhibition Constant Data from BindingDB
Found 2 hits for monomerid = 50211702
Trg + Lig
Ki
nM
ΔG°
kcal/mole
IC50
nM
Kd
nM
EC50/IC50
nM
koff
s-1
kon
M-1s-1
pHTemp
°C
Dihydroorotate dehydrogenase (quinone), mitochondrial
(Homo sapiens (Human))
BDBM50211702
(CHEMBL3962745)
Show SMILES NCCO.COc1ccc2ccc(CCc3c([nH]c(=O)[nH]c3=O)C(O)=O)cc2c1
Show InChI InChI=1S/C18H16N2O5/c1-25-13-6-5-11-4-2-10(8-12(11)9-13)3-7-14-15(17(22)23)19-18(24)20-16(14)21/h2,4-6,8-9H,3,7H2,1H3,(H,22,23)(H2,19,20,21,24)
Reactome pathway
6.65E+3n/an/an/an/an/an/an/an/a
Nagasaki University
Curated by ChEMBL
Assay Description
Inhibition of human dihydroorotate dehydrogenase assessed as reduction in orotate production using L-dihydroorotate as substrate measured after 20 mi...
Bioorg Med Chem 25: 1465-1470 (2017)
Article DOI: 10.1016/j.bmc.2017.01.009
BindingDB Entry DOI: 10.7270/Q2CC12TS
Dihydroorotate dehydrogenase (quinone), mitochondrial
(Homo sapiens (Human))
BDBM50211702
(CHEMBL3962745)
Show SMILES NCCO.COc1ccc2ccc(CCc3c([nH]c(=O)[nH]c3=O)C(O)=O)cc2c1
Show InChI InChI=1S/C18H16N2O5/c1-25-13-6-5-11-4-2-10(8-12(11)9-13)3-7-14-15(17(22)23)19-18(24)20-16(14)21/h2,4-6,8-9H,3,7H2,1H3,(H,22,23)(H2,19,20,21,24)
Reactome pathway
n/an/a 13n/an/an/an/an/an/a
Nagasaki University
Curated by ChEMBL
Assay Description
Inhibition of human dihydroorotate dehydrogenase assessed as reduction in orotate production using L-dihydroorotate as substrate measured after 20 mi...
Bioorg Med Chem 25: 1465-1470 (2017)
Article DOI: 10.1016/j.bmc.2017.01.009
BindingDB Entry DOI: 10.7270/Q2CC12TS