BDBM50211745 CHEMBL3899009
SMILES: NCCO.OC(=O)c1[nH]c(=O)[nH]c(=O)c1CCc1cccc(c1)C(F)(F)F
InChI Key: InChIKey=KJPHDCMBIHOWFV-UHFFFAOYSA-N
Data: 1 KI  1 IC50
Activity Spreadsheet -- Enzyme Inhibition Constant Data from BindingDB
Found 2 hits for monomerid = 50211745
Trg + Lig
Ki
nM
ΔG°
kcal/mole
IC50
nM
Kd
nM
EC50/IC50
nM
koff
s-1
kon
M-1s-1
pHTemp
°C
Dihydroorotate dehydrogenase
(Homo sapiens (Human))
BDBM50211745
(CHEMBL3899009)
Show SMILES NCCO.OC(=O)c1[nH]c(=O)[nH]c(=O)c1CCc1cccc(c1)C(F)(F)F
Show InChI InChI=1S/C14H11F3N2O4/c15-14(16,17)8-3-1-2-7(6-8)4-5-9-10(12(21)22)18-13(23)19-11(9)20/h1-3,6H,4-5H2,(H,21,22)(H2,18,19,20,23)
Reactome pathway
1.42E+5n/an/an/an/an/an/an/an/a
Nagasaki University
Curated by ChEMBL
Assay Description
Inhibition of human dihydroorotate dehydrogenase assessed as reduction in orotate production using L-dihydroorotate as substrate measured after 20 mi...
Bioorg Med Chem 25: 1465-1470 (2017)
Article DOI: 10.1016/j.bmc.2017.01.009
BindingDB Entry DOI: 10.7270/Q2CC12TS
Dihydroorotate dehydrogenase
(Homo sapiens (Human))
BDBM50211745
(CHEMBL3899009)
Show SMILES NCCO.OC(=O)c1[nH]c(=O)[nH]c(=O)c1CCc1cccc(c1)C(F)(F)F
Show InChI InChI=1S/C14H11F3N2O4/c15-14(16,17)8-3-1-2-7(6-8)4-5-9-10(12(21)22)18-13(23)19-11(9)20/h1-3,6H,4-5H2,(H,21,22)(H2,18,19,20,23)
Reactome pathway
n/an/a 284n/an/an/an/an/an/a
Nagasaki University
Curated by ChEMBL
Assay Description
Inhibition of human dihydroorotate dehydrogenase assessed as reduction in orotate production using L-dihydroorotate as substrate measured after 20 mi...
Bioorg Med Chem 25: 1465-1470 (2017)
Article DOI: 10.1016/j.bmc.2017.01.009
BindingDB Entry DOI: 10.7270/Q2CC12TS