BDBM50211956 2-(3-hydroxy-5-methoxyphenethyl)phenol::Batatasin IV (5)::CHEMBL228126::batatasin IV
SMILES: COc1cc(O)cc(CCc2ccccc2O)c1
InChI Key: InChIKey=IUMFLNFLJUUODE-UHFFFAOYSA-N
Data: 1 KI  5 IC50
PDB links: 1 PDB ID matches this monomer.
Activity Spreadsheet -- Enzyme Inhibition Constant Data from BindingDB
Found 5 hits for monomerid = 50211956
Trg + Lig
Ki
nM
ΔG°
kcal/mole
IC50
nM
Kd
nM
EC50/IC50
nM
koff
s-1
kon
M-1s-1
pHTemp
°C
Pancreatic lipase
(Sus scrofa (Pig))
BDBM50211956
(2-(3-hydroxy-5-methoxyphenethyl)phenol | Batatasin...)
Show SMILES COc1cc(O)cc(CCc2ccccc2O)c1
Show InChI InChI=1S/C15H16O3/c1-18-14-9-11(8-13(16)10-14)6-7-12-4-2-3-5-15(12)17/h2-5,8-10,16-17H,6-7H2,1H3
6.28E+3 -7.38 3.01E+4n/an/an/an/a7.437
Seoul National University
Assay Description
Various concentrations of test compound (5, 10, 25, 50 and 100 mM) were dissolved in DMSO (final culture concentration 0.1%) and 4-MU oleate and lipa...
J Enzyme Inhib Med Chem 29: 1-6 (2014)
Article DOI: 10.3109/14756366.2012.742517
BindingDB Entry DOI: 10.7270/Q2DJ5DKB
Prostaglandin G/H synthase (cyclooxygenase)
(Ovis aries (Sheep))
BDBM50211956
(2-(3-hydroxy-5-methoxyphenethyl)phenol | Batatasin...)
Show SMILES COc1cc(O)cc(CCc2ccccc2O)c1
Show InChI InChI=1S/C15H16O3/c1-18-14-9-11(8-13(16)10-14)6-7-12-4-2-3-5-15(12)17/h2-5,8-10,16-17H,6-7H2,1H3
n/an/a>4.09E+5n/an/an/an/an/an/a
Seoul National University
Curated by ChEMBL
Assay Description
Inhibition of ovine COX1 by colorimetric assay
Bioorg Med Chem 17: 2689-94 (2009)
Article DOI: 10.1016/j.bmc.2009.02.057
BindingDB Entry DOI: 10.7270/Q2RF5XTR
Prostaglandin G/H synthase (cyclooxygenase)
(Ovis aries (Sheep))
BDBM50211956
(2-(3-hydroxy-5-methoxyphenethyl)phenol | Batatasin...)
Show SMILES COc1cc(O)cc(CCc2ccccc2O)c1
Show InChI InChI=1S/C15H16O3/c1-18-14-9-11(8-13(16)10-14)6-7-12-4-2-3-5-15(12)17/h2-5,8-10,16-17H,6-7H2,1H3
n/an/a>4.09E+5n/an/an/an/an/an/a
Seoul National University
Curated by ChEMBL
Assay Description
Inhibition of ovine COX2 by colorimetric assay
Bioorg Med Chem 17: 2689-94 (2009)
Article DOI: 10.1016/j.bmc.2009.02.057
BindingDB Entry DOI: 10.7270/Q2RF5XTR
Cyclooxygenase-1 (COX-1)
(Homo sapiens (Human))
BDBM50211956
(2-(3-hydroxy-5-methoxyphenethyl)phenol | Batatasin...)
Show SMILES COc1cc(O)cc(CCc2ccccc2O)c1
Show InChI InChI=1S/C15H16O3/c1-18-14-9-11(8-13(16)10-14)6-7-12-4-2-3-5-15(12)17/h2-5,8-10,16-17H,6-7H2,1H3
n/an/a>4.09E+4n/an/an/an/an/an/a
Chiang Mai University
Curated by ChEMBL
Assay Description
Inhibition of COX1 by radioimmunoassay method
J Nat Prod 70: 795-801 (2007)
Article DOI: 10.1021/np070010e
BindingDB Entry DOI: 10.7270/Q2R78DXZ
Cyclooxygenase
(Homo sapiens (Human))
BDBM50211956
(2-(3-hydroxy-5-methoxyphenethyl)phenol | Batatasin...)
Show SMILES COc1cc(O)cc(CCc2ccccc2O)c1
Show InChI InChI=1S/C15H16O3/c1-18-14-9-11(8-13(16)10-14)6-7-12-4-2-3-5-15(12)17/h2-5,8-10,16-17H,6-7H2,1H3
NCI pathway
Reactome pathway
n/an/a>4.09E+4n/an/an/an/an/an/a
Chiang Mai University
Curated by ChEMBL
Assay Description
Inhibition of COX2 by radioimmunoassay method
J Nat Prod 70: 795-801 (2007)
Article DOI: 10.1021/np070010e
BindingDB Entry DOI: 10.7270/Q2R78DXZ