null
SMILES: NCCO.COC(=O)c1cccc2cc(CCCCc3c([nH]c(=O)[nH]c3=O)C(O)=O)ccc12
InChI Key: InChIKey=ILXUNLFRSXVJJZ-UHFFFAOYSA-N
Activity Spreadsheet -- Enzyme Inhibition Constant Data from BindingDB
Found 2 hits for monomerid = 50211959
Trg + Lig
Ki
nM
ΔG°
kcal/mole
IC50
nM
Kd
nM
EC50/IC50
nM
koff
s-1
kon
M-1s-1
pHTemp
°C
Dihydroorotate dehydrogenase (quinone), mitochondrial
(Homo sapiens (Human))
BDBM50211959
(CHEMBL3955099)
Show SMILES NCCO.COC(=O)c1cccc2cc(CCCCc3c([nH]c(=O)[nH]c3=O)C(O)=O)ccc12
Show InChI InChI=1S/C21H20N2O6/c1-29-20(27)15-8-4-6-13-11-12(9-10-14(13)15)5-2-3-7-16-17(19(25)26)22-21(28)23-18(16)24/h4,6,8-11H,2-3,5,7H2,1H3,(H,25,26)(H2,22,23,24,28)
Reactome pathway
1.20E+4n/an/an/an/an/an/an/an/a
Nagasaki University
Curated by ChEMBL
Assay Description
Inhibition of human dihydroorotate dehydrogenase assessed as reduction in orotate production using L-dihydroorotate as substrate measured after 20 mi...
Bioorg Med Chem 25: 1465-1470 (2017)
Article DOI: 10.1016/j.bmc.2017.01.009
BindingDB Entry DOI: 10.7270/Q2CC12TS
Dihydroorotate dehydrogenase (quinone), mitochondrial
(Homo sapiens (Human))
BDBM50211959
(CHEMBL3955099)
Show SMILES NCCO.COC(=O)c1cccc2cc(CCCCc3c([nH]c(=O)[nH]c3=O)C(O)=O)ccc12
Show InChI InChI=1S/C21H20N2O6/c1-29-20(27)15-8-4-6-13-11-12(9-10-14(13)15)5-2-3-7-16-17(19(25)26)22-21(28)23-18(16)24/h4,6,8-11H,2-3,5,7H2,1H3,(H,25,26)(H2,22,23,24,28)
Reactome pathway
n/an/a 24n/an/an/an/an/an/a
Nagasaki University
Curated by ChEMBL
Assay Description
Inhibition of human dihydroorotate dehydrogenase assessed as reduction in orotate production using L-dihydroorotate as substrate measured after 20 mi...
Bioorg Med Chem 25: 1465-1470 (2017)
Article DOI: 10.1016/j.bmc.2017.01.009
BindingDB Entry DOI: 10.7270/Q2CC12TS