null
SMILES: CN1CCN(CCc2ccc(Nc3ncc(C#N)c(n3)-c3ccc(cc3)C(C)(C)N)cc2)CC1
InChI Key: InChIKey=LNPGEMWHMALOTH-UHFFFAOYSA-N
Activity Spreadsheet -- Enzyme Inhibition Constant Data from BindingDB
Found 2 hits for monomerid = 50212033
Trg + Lig
Ki
nM
ΔG°
kcal/mole
IC50
nM
Kd
nM
EC50/IC50
nM
koff
s-1
kon
M-1s-1
pHTemp
°C
Cyclin-dependent kinase 1
(Homo sapiens (Human))
BDBM50212033
(4-(4-(2-aminopropan-2-yl)phenyl)-2-(4-(2-(4-methyl...)
Show SMILES CN1CCN(CCc2ccc(Nc3ncc(C#N)c(n3)-c3ccc(cc3)C(C)(C)N)cc2)CC1
Show InChI InChI=1S/C27H33N7/c1-27(2,29)23-8-6-21(7-9-23)25-22(18-28)19-30-26(32-25)31-24-10-4-20(5-11-24)12-13-34-16-14-33(3)15-17-34/h4-11,19H,12-17,29H2,1-3H3,(H,30,31,32)
Reactome pathway
n/an/a 5.60E+3n/an/an/an/an/an/a
Johnson & Johnson Pharmaceutical Research and Development
Curated by ChEMBL
Assay Description
Inhibition of CDK1 activity
Bioorg Med Chem Lett 17: 3266-70 (2007)
Article DOI: 10.1016/j.bmcl.2007.04.021
BindingDB Entry DOI: 10.7270/Q2GQ6XFG
Vascular endothelial growth factor receptor 2
(Homo sapiens (Human))
BDBM50212033
(4-(4-(2-aminopropan-2-yl)phenyl)-2-(4-(2-(4-methyl...)
Show SMILES CN1CCN(CCc2ccc(Nc3ncc(C#N)c(n3)-c3ccc(cc3)C(C)(C)N)cc2)CC1
Show InChI InChI=1S/C27H33N7/c1-27(2,29)23-8-6-21(7-9-23)25-22(18-28)19-30-26(32-25)31-24-10-4-20(5-11-24)12-13-34-16-14-33(3)15-17-34/h4-11,19H,12-17,29H2,1-3H3,(H,30,31,32)
NCI pathway
Reactome pathway
n/an/a 21n/an/an/an/an/an/a
Johnson & Johnson Pharmaceutical Research and Development
Curated by ChEMBL
Assay Description
Inhibition of VEGFR2 activity
Bioorg Med Chem Lett 17: 3266-70 (2007)
Article DOI: 10.1016/j.bmcl.2007.04.021
BindingDB Entry DOI: 10.7270/Q2GQ6XFG