null
SMILES: CC(C)Oc1ccc2CN(C(=O)c2c1)c1cccc(n1)-c1nncn1[C@H](C)CO
InChI Key: InChIKey=ATENFOTVOKHAOY-CQSZACIVSA-N
PDB links: 1 PDB ID matches this monomer.
Activity Spreadsheet -- Enzyme Inhibition Constant Data from BindingDB
Found 2 hits for monomerid = 50212260
Trg + Lig
Ki
nM
ΔG°
kcal/mole
IC50
nM
Kd
nM
EC50/IC50
nM
koff
s-1
kon
M-1s-1
pHTemp
°C
Mitogen-activated protein kinase kinase kinase 5
(Homo sapiens (Human))
BDBM50212260
(CHEMBL3954836)
Show SMILES CC(C)Oc1ccc2CN(C(=O)c2c1)c1cccc(n1)-c1nncn1[C@H](C)CO |r|
Show InChI InChI=1S/C21H23N5O3/c1-13(2)29-16-8-7-15-10-25(21(28)17(15)9-16)19-6-4-5-18(23-19)20-24-22-12-26(20)14(3)11-27/h4-9,12-14,27H,10-11H2,1-3H3/t14-/m1/s1
n/an/a 5n/an/an/an/an/an/a
Takeda Pharmaceuticals
Curated by ChEMBL
Assay Description
Inhibition of recombinant human N-terminal GST-tagged ASK1 catalytic domain (654 to 971 residues) expressed in baculovirus infected sf21 cells using ...
ACS Med Chem Lett 8: 316-320 (2017)
Article DOI: 10.1021/acsmedchemlett.6b00481
BindingDB Entry DOI: 10.7270/Q2BC41QV
3D
3D Structure (crystal)
Mitogen-activated protein kinase kinase kinase 5
(Homo sapiens (Human))
BDBM50212260
(CHEMBL3954836)
Show SMILES CC(C)Oc1ccc2CN(C(=O)c2c1)c1cccc(n1)-c1nncn1[C@H](C)CO |r|
Show InChI InChI=1S/C21H23N5O3/c1-13(2)29-16-8-7-15-10-25(21(28)17(15)9-16)19-6-4-5-18(23-19)20-24-22-12-26(20)14(3)11-27/h4-9,12-14,27H,10-11H2,1-3H3/t14-/m1/s1
n/an/an/an/a 6.30n/an/an/an/a
Takeda Pharmaceuticals
Curated by ChEMBL
Assay Description
Inhibition of human ASK1 expressed in HEK293 cells assessed as inhibition of H2O2-induced JNK phosphorylation preincubated for 30 mins followed by H2...
ACS Med Chem Lett 8: 316-320 (2017)
Article DOI: 10.1021/acsmedchemlett.6b00481
BindingDB Entry DOI: 10.7270/Q2BC41QV
3D
3D Structure (crystal)