null
SMILES: CCn1c2cc(ccc2c2CCCc2c1=O)-c1cc(\C=C\C(O)=O)ccc1OC(F)(F)F
InChI Key: InChIKey=DKMRHVDEXKTNTG-YRNVUSSQSA-N
Activity Spreadsheet -- Enzyme Inhibition Constant Data from BindingDB
Found 1 hit for monomerid = 50212272
Trg + Lig
Ki
nM
ΔG°
kcal/mole
IC50
nM
Kd
nM
EC50/IC50
nM
koff
s-1
kon
M-1s-1
pHTemp
°C
Retinoic acid receptor RXR-alpha
(Homo sapiens (Human))
BDBM50212272
(3-(3-(5-ethyl-8-methyl-4-oxo-2,3,4,5-tetrahydro-1H...)
Show SMILES CCn1c2cc(ccc2c2CCCc2c1=O)-c1cc(\C=C\C(O)=O)ccc1OC(F)(F)F
Show InChI InChI=1S/C24H20F3NO4/c1-2-28-20-13-15(8-9-17(20)16-4-3-5-18(16)23(28)31)19-12-14(7-11-22(29)30)6-10-21(19)32-24(25,26)27/h6-13H,2-5H2,1H3,(H,29,30)/b11-7+
NCI pathway
Reactome pathway
n/an/an/an/a 1.60E+3n/an/an/an/a
Johnson and Johnson Pharmaceutical Research and Development
Curated by ChEMBL
Assay Description
Activity at RXRalpha by GAL4DNA cotransfection assay
Bioorg Med Chem Lett 17: 3497-503 (2007)
Article DOI: 10.1016/j.bmcl.2007.01.047
BindingDB Entry DOI: 10.7270/Q2FQ9W93