BDBM50212275 3-(4-(trifluoromethoxy)-3-(4,4,6-trimethyl-2-oxo-1-(2,2,2-trifluoroethyl)-1,2,3,4-tetrahydroquinolin-7-yl)phenyl)acrylic acid::CHEMBL247005
SMILES: Cc1cc2c(cc1-c1cc(\C=C\C(O)=O)ccc1OC(F)(F)F)N(CC(F)(F)F)C(=O)CC2(C)C
InChI Key: InChIKey=UTSXJPKPEYSNHD-FNORWQNLSA-N
Data: 1 EC50
Activity Spreadsheet -- Enzyme Inhibition Constant Data from BindingDB
Found 1 hit for monomerid = 50212275
Trg + Lig
Ki
nM
ΔG°
kcal/mole
IC50
nM
Kd
nM
EC50/IC50
nM
koff
s-1
kon
M-1s-1
pHTemp
°C
Retinoic acid receptor RXR-alpha
(Homo sapiens (Human))
BDBM50212275
(3-(4-(trifluoromethoxy)-3-(4,4,6-trimethyl-2-oxo-1...)
Show SMILES Cc1cc2c(cc1-c1cc(\C=C\C(O)=O)ccc1OC(F)(F)F)N(CC(F)(F)F)C(=O)CC2(C)C
Show InChI InChI=1S/C24H21F6NO4/c1-13-8-17-18(31(12-23(25,26)27)20(32)11-22(17,2)3)10-15(13)16-9-14(5-7-21(33)34)4-6-19(16)35-24(28,29)30/h4-10H,11-12H2,1-3H3,(H,33,34)/b7-5+
NCI pathway
Reactome pathway
n/an/an/an/a 1.80n/an/an/an/a
Johnson and Johnson Pharmaceutical Research and Development
Curated by ChEMBL
Assay Description
Activity at RXRalpha by GAL4DNA cotransfection assay
Bioorg Med Chem Lett 17: 3497-503 (2007)
Article DOI: 10.1016/j.bmcl.2007.01.047
BindingDB Entry DOI: 10.7270/Q2FQ9W93