BDBM50212283 (E)-3-(3-(1-ethyl-4,4,6-trimethyl-2-oxo-1,2,3,4-tetrahydroquinolin-7-yl)-4-(2,2,2-trifluoroethoxy)phenyl)acrylic acid::CHEMBL400557
SMILES: CCN1C(=O)CC(C)(C)c2cc(C)c(cc12)-c1cc(\C=C\C(O)=O)ccc1OCC(F)(F)F
InChI Key: InChIKey=DXRZIQJDJBTQMU-VQHVLOKHSA-N
Data: 1 EC50
Activity Spreadsheet -- Enzyme Inhibition Constant Data from BindingDB
Found 1 hit for monomerid = 50212283
Trg + Lig
Ki
nM
ΔG°
kcal/mole
IC50
nM
Kd
nM
EC50/IC50
nM
koff
s-1
kon
M-1s-1
pHTemp
°C
Retinoic acid receptor RXR-alpha
(Homo sapiens (Human))
BDBM50212283
((E)-3-(3-(1-ethyl-4,4,6-trimethyl-2-oxo-1,2,3,4-te...)
Show SMILES CCN1C(=O)CC(C)(C)c2cc(C)c(cc12)-c1cc(\C=C\C(O)=O)ccc1OCC(F)(F)F
Show InChI InChI=1S/C25H26F3NO4/c1-5-29-20-12-17(15(2)10-19(20)24(3,4)13-22(29)30)18-11-16(7-9-23(31)32)6-8-21(18)33-14-25(26,27)28/h6-12H,5,13-14H2,1-4H3,(H,31,32)/b9-7+
NCI pathway
Reactome pathway
n/an/an/an/a 67.3n/an/an/an/a
Johnson and Johnson Pharmaceutical Research and Development
Curated by ChEMBL
Assay Description
Activity at RXRalpha by GAL4DNA cotransfection assay
Bioorg Med Chem Lett 17: 3497-503 (2007)
Article DOI: 10.1016/j.bmcl.2007.01.047
BindingDB Entry DOI: 10.7270/Q2FQ9W93