BDBM50212391 5-deoxyabyssinin II::CHEMBL229670
SMILES: [#6]-[#8]-c1cc(cc(-[#6]\[#6]=[#6](\[#6])-[#6])c1-[#8])-[#6@@H]-1-[#6]-[#6](=O)-c2ccc(-[#8])cc2-[#8]-1
InChI Key: InChIKey=GZTDFKLABHOHBU-SFHVURJKSA-N
Data: 2 IC50
Activity Spreadsheet -- Enzyme Inhibition Constant Data from BindingDB
Found 2 hits for monomerid = 50212391
Trg + Lig
Ki
nM
ΔG°
kcal/mole
IC50
nM
Kd
nM
EC50/IC50
nM
koff
s-1
kon
M-1s-1
pHTemp
°C
Protein-tyrosine phosphatase 1B
(Homo sapiens (Human))
BDBM50212391
(5-deoxyabyssinin II | CHEMBL229670)
Show SMILES [#6]-[#8]-c1cc(cc(-[#6]\[#6]=[#6](\[#6])-[#6])c1-[#8])-[#6@@H]-1-[#6]-[#6](=O)-c2ccc(-[#8])cc2-[#8]-1
Show InChI InChI=1S/C21H22O5/c1-12(2)4-5-13-8-14(9-20(25-3)21(13)24)18-11-17(23)16-7-6-15(22)10-19(16)26-18/h4,6-10,18,22,24H,5,11H2,1-3H3/t18-/m0/s1
NCI pathway
Reactome pathway
n/an/a 1.92E+4n/an/an/an/an/an/a
Korea Research Institute of Bioscience and Biotechnology
Curated by ChEMBL
Assay Description
Inhibition of human recombinant PTP1B
J Nat Prod 70: 1039-42 (2007)
Article DOI: 10.1021/np060477+
BindingDB Entry DOI: 10.7270/Q2KH0P5K
Protein-tyrosine phosphatase 1B
(Homo sapiens (Human))
BDBM50212391
(5-deoxyabyssinin II | CHEMBL229670)
Show SMILES [#6]-[#8]-c1cc(cc(-[#6]\[#6]=[#6](\[#6])-[#6])c1-[#8])-[#6@@H]-1-[#6]-[#6](=O)-c2ccc(-[#8])cc2-[#8]-1
Show InChI InChI=1S/C21H22O5/c1-12(2)4-5-13-8-14(9-20(25-3)21(13)24)18-11-17(23)16-7-6-15(22)10-19(16)26-18/h4,6-10,18,22,24H,5,11H2,1-3H3/t18-/m0/s1
NCI pathway
Reactome pathway
n/an/a 1.92E+4n/an/an/an/an/an/a
Chosun University
Curated by ChEMBL
Assay Description
Inhibition of human recombinant PTP1B assessed as p-nitorphenol production after 30 mins
Bioorg Med Chem 19: 3378-83 (2011)
Article DOI: 10.1016/j.bmc.2011.04.037
BindingDB Entry DOI: 10.7270/Q2DF6RKT