BDBM50212430 (3aR,4R,9aS,E)-6-fluoro-4-(2-(5-(3-fluorophenyl)pyridin-2-yl)vinyl)-3a,4,9,9a-tetrahydronaphtho[2,3-c]furan-1(3H)-one::CHEMBL269006
SMILES: Fc1cccc(c1)-c1ccc(\C=C\[C@@H]2[C@H]3COC(=O)[C@H]3Cc3ccc(F)cc23)nc1
InChI Key: InChIKey=BEWNXUIFEFYIAT-TVUVQBGUSA-N
Data: 1 IC50
Activity Spreadsheet -- Enzyme Inhibition Constant Data from BindingDB
Found 1 hit for monomerid = 50212430
Trg + Lig
Ki
nM
ΔG°
kcal/mole
IC50
nM
Kd
nM
EC50/IC50
nM
koff
s-1
kon
M-1s-1
pHTemp
°C
Proteinase-activated receptor 1
(Homo sapiens (Human))
BDBM50212430
((3aR,4R,9aS,E)-6-fluoro-4-(2-(5-(3-fluorophenyl)py...)
Show SMILES Fc1cccc(c1)-c1ccc(\C=C\[C@@H]2[C@H]3COC(=O)[C@H]3Cc3ccc(F)cc23)nc1
Show InChI InChI=1S/C25H19F2NO2/c26-18-3-1-2-15(10-18)17-5-7-20(28-13-17)8-9-21-22-12-19(27)6-4-16(22)11-23-24(21)14-30-25(23)29/h1-10,12-13,21,23-24H,11,14H2/b9-8+/t21-,23-,24+/m0/s1
n/an/a 10n/an/an/an/an/an/a
Schering-Plough Research Institute
Curated by ChEMBL
Assay Description
Displacement of [3H]haTRAP from PAR1
Bioorg Med Chem Lett 17: 3647-51 (2007)
Article DOI: 10.1016/j.bmcl.2007.04.061
BindingDB Entry DOI: 10.7270/Q2JH3KV4