BDBM50212437 (3aR,4R,9aS,E)-4-(2-(5-(3-chlorophenyl)pyridin-2-yl)vinyl)-3a,4,9,9a-tetrahydronaphtho[2,3-c]furan-1(3H)-one::CHEMBL399820
SMILES: Clc1cccc(c1)-c1ccc(\C=C\[C@@H]2[C@H]3COC(=O)[C@H]3Cc3ccccc23)nc1
InChI Key: InChIKey=OWGKJNOKBSHVFV-DJJNJRNKSA-N
Data: 1 IC50
Activity Spreadsheet -- Enzyme Inhibition Constant Data from BindingDB
Found 1 hit for monomerid = 50212437
Trg + Lig
Ki
nM
ΔG°
kcal/mole
IC50
nM
Kd
nM
EC50/IC50
nM
koff
s-1
kon
M-1s-1
pHTemp
°C
Proteinase-activated receptor 1
(Homo sapiens (Human))
BDBM50212437
((3aR,4R,9aS,E)-4-(2-(5-(3-chlorophenyl)pyridin-2-y...)
Show SMILES Clc1cccc(c1)-c1ccc(\C=C\[C@@H]2[C@H]3COC(=O)[C@H]3Cc3ccccc23)nc1
Show InChI InChI=1S/C25H20ClNO2/c26-19-6-3-5-16(12-19)18-8-9-20(27-14-18)10-11-22-21-7-2-1-4-17(21)13-23-24(22)15-29-25(23)28/h1-12,14,22-24H,13,15H2/b11-10+/t22-,23-,24+/m0/s1
n/an/a 14.5n/an/an/an/an/an/a
Schering-Plough Research Institute
Curated by ChEMBL
Assay Description
Displacement of [3H]haTRAP from PAR1
Bioorg Med Chem Lett 17: 3647-51 (2007)
Article DOI: 10.1016/j.bmcl.2007.04.061
BindingDB Entry DOI: 10.7270/Q2JH3KV4