BDBM50212474 CHEMBL423731::RK-286C
SMILES: [H][C@]1(O)C[C@]2([H])O[C@](C)([C@H]1OC)n1c3ccccc3c3c4CNC(=O)c4c4c5ccccc5n2c4c13
InChI Key: InChIKey=OSJFVOAURBIGTC-SFDUFSHASA-N
Data: 1 IC50
Activity Spreadsheet -- Enzyme Inhibition Constant Data from BindingDB
Found 1 hit for monomerid = 50212474
Trg + Lig
Ki
nM
ΔG°
kcal/mole
IC50
nM
Kd
nM
EC50/IC50
nM
koff
s-1
kon
M-1s-1
pHTemp
°C
Protein kinase C (PKC)
(Homo sapiens (Human))
BDBM50212474
(CHEMBL423731 | RK-286C)
Show SMILES [H][C@]1(O)C[C@]2([H])O[C@](C)([C@H]1OC)n1c3ccccc3c3c4CNC(=O)c4c4c5ccccc5n2c4c13
Show InChI InChI=1S/C27H23N3O4/c1-27-25(33-2)18(31)11-19(34-27)29-16-9-5-3-7-13(16)21-22-15(12-28-26(22)32)20-14-8-4-6-10-17(14)30(27)24(20)23(21)29/h3-10,18-19,25,31H,11-12H2,1-2H3,(H,28,32)/t18-,19-,25-,27+/m0/s1
n/an/a 3.00E+3n/an/an/an/an/an/a
TBA
Assay Description
Inhibition of protein kinase C
Citation and Details
BindingDB Entry DOI: 10.7270/Q2HX1FVJ