BDBM50212497 CHEMBL234868::[3-(4'-hydroxy-biphenyl-4-yl)-7-methoxy-1,4-dihydro-indeno[1,2-c]pyrazol-6-yl]-(4-hydroxy-piperidin-1-yl)-methanone
SMILES: COc1cc-2c(Cc3c(n[nH]c-23)-c2ccc(cc2)-c2ccc(O)cc2)cc1C(=O)N1CCC(O)CC1
InChI Key: InChIKey=YNGBKULAMYEPRH-UHFFFAOYSA-N
Data: 1 IC50
Activity Spreadsheet -- Enzyme Inhibition Constant Data from BindingDB
Found 1 hit for monomerid = 50212497
Trg + Lig
Ki
nM
ΔG°
kcal/mole
IC50
nM
Kd
nM
EC50/IC50
nM
koff
s-1
kon
M-1s-1
pHTemp
°C
Serine/threonine-protein kinase Chk1
(Homo sapiens (Human))
BDBM50212497
(CHEMBL234868 | [3-(4'-hydroxy-biphenyl-4-yl)-7-met...)
Show SMILES COc1cc-2c(Cc3c(n[nH]c-23)-c2ccc(cc2)-c2ccc(O)cc2)cc1C(=O)N1CCC(O)CC1
Show InChI InChI=1S/C29H27N3O4/c1-36-26-16-23-20(14-24(26)29(35)32-12-10-22(34)11-13-32)15-25-27(30-31-28(23)25)19-4-2-17(3-5-19)18-6-8-21(33)9-7-18/h2-9,14,16,22,33-34H,10-13,15H2,1H3,(H,30,31)
Reactome pathway
n/an/a 0.240n/an/an/an/an/an/a
Abbott Laboratories
Curated by ChEMBL
Assay Description
Inhibition of recombinant CHK-mediated Cdc25C phosphorylation after 30 mins
Bioorg Med Chem Lett 17: 3618-23 (2007)
Article DOI: 10.1016/j.bmcl.2007.04.055
BindingDB Entry DOI: 10.7270/Q2DR2V6Q