BDBM50212498 3-(4'-hydroxy-biphenyl-4-yl)-1,4-dihydro-indeno[1,2-c]pyrazole-7-carboxylic acid (2-hydroxy-ethyl)-amide::CHEMBL232805
SMILES: OCCNC(=O)c1ccc2Cc3c(n[nH]c3-c2c1)-c1ccc(cc1)-c1ccc(O)cc1
InChI Key: InChIKey=MIPSYHDNPSQXBK-UHFFFAOYSA-N
Data: 1 IC50
Activity Spreadsheet -- Enzyme Inhibition Constant Data from BindingDB
Found 1 hit for monomerid = 50212498
Trg + Lig
Ki
nM
ΔG°
kcal/mole
IC50
nM
Kd
nM
EC50/IC50
nM
koff
s-1
kon
M-1s-1
pHTemp
°C
Serine/threonine-protein kinase Chk1
(Homo sapiens (Human))
BDBM50212498
(3-(4'-hydroxy-biphenyl-4-yl)-1,4-dihydro-indeno[1,...)
Show SMILES OCCNC(=O)c1ccc2Cc3c(n[nH]c3-c2c1)-c1ccc(cc1)-c1ccc(O)cc1
Show InChI InChI=1S/C25H21N3O3/c29-12-11-26-25(31)19-6-5-18-13-22-23(27-28-24(22)21(18)14-19)17-3-1-15(2-4-17)16-7-9-20(30)10-8-16/h1-10,14,29-30H,11-13H2,(H,26,31)(H,27,28)
Reactome pathway
n/an/a 5n/an/an/an/an/an/a
Abbott Laboratories
Curated by ChEMBL
Assay Description
Inhibition of recombinant CHK-mediated Cdc25C phosphorylation after 30 mins
Bioorg Med Chem Lett 17: 3618-23 (2007)
Article DOI: 10.1016/j.bmcl.2007.04.055
BindingDB Entry DOI: 10.7270/Q2DR2V6Q